Cyclohexane, 1r,2c,4t-triethyl

Kovats' RI, non-polar column, isothermal

View large format table.

Column type Active phase Temperature (C) I Reference Comment
CapillarySqualane79.1095.Engewald, Graefe, et al., 1974N2; Column length: 120. m; Column diameter: 0.20 mm

References

Engewald, Graefe, et al., 1974
Engewald, W.; Graefe, J.; Kiselev, A.V.; Shcherbakova, K.D.; Welsch, Th., Molekülstruktur und Retentionsverhalten. I. Strukturelle Zuordnung von thermischen Umlagerungsprodukten der Cyclododecatriene-(1.5.9) mittels Gas-Adsorptions-Chromatographie, Chromatographia, 1974, 7, 5, 229-235, https://doi.org/10.1007/BF02321773 . [all data]