Butanoic acid, 2,2,3,3-tetramethyl, ethyl ester

Kovats' RI, non-polar column, isothermal

View large format table.

Column type Active phase Temperature (C) I Reference Comment
PackedSE-30120.987.Haken, Chretien, et al., 1981Chromosorb W AW DMCS; Column length: 3.7 m

References

Haken, Chretien, et al., 1981
Haken, J.K.; Chretien, J.R.; Lion, C., Gas-liquid chromatographic retention behaviour of hindered aliphatic esters, J. Chromatogr., 1981, 217, 125-137, https://doi.org/10.1016/S0021-9673(00)88067-X . [all data]