Furan-3-carboxylic acid, 4-methyl-2-(2-methoxycarbonylethyl)-5-(4-oxopentyl), methyl ester

Normal alkane RI, non-polar column, temperature ramp

View large format table.

Column type Active phase I Reference Comment
CapillaryOV-1012100.Spiteller and Spiteller, 1979He, 75. C @ 7. min, 2. K/min; Column length: 25. m; Tend: 280. C

References

Spiteller and Spiteller, 1979
Spiteller, M.; Spiteller, G., Trennung und charakterisierung saurer harnbest and- teile, J. Chromatogr., 1979, 164, 3, 253-317, https://doi.org/10.1016/S0378-4347(00)81232-3 . [all data]