Cyclopentane, 1-methyl-2-pentyl, cis

Kovats' RI, non-polar column, isothermal

View large format table.

Column type Active phase Temperature (C) I Reference Comment
PackedSqualane100.1116.Bogoslovsky, Anvaer, et al., 1978
PackedSqualane120.1120.Bogoslovsky, Anvaer, et al., 1978
PackedSqualane80.1111.Bogoslovsky, Anvaer, et al., 1978
CapillarySqualane100.1116.Dielmann, Schwengers, et al., 1974Column length: 100. m; Column diameter: 0.25 mm
CapillarySqualane120.1120.Dielmann, Schwengers, et al., 1974Column length: 100. m; Column diameter: 0.25 mm
CapillarySqualane80.1111.Dielmann, Schwengers, et al., 1974Column length: 100. m; Column diameter: 0.25 mm

References

Bogoslovsky, Anvaer, et al., 1978
Bogoslovsky, Yu.N.; Anvaer, B.I.; Vigdergauz, M.S., Chromatographic constants in gas chromatography (in Russian), Standards Publ. House, Moscow, 1978, 192. [all data]

Dielmann, Schwengers, et al., 1974
Dielmann, G.; Schwengers, D.; Schomburg, G., Gas-chromatographische Retentionsdaten und Strukture chemischer Verbindungen Gesättigte und ungesättigte alkylsubstituierte Cyclopentane und Methylcyclopentane, Chromatographia, 1974, 7, 5, 215-224, https://doi.org/10.1007/BF02321771 . [all data]