Cyclopentane, 1-butyl-1-methyl

Kovats' RI, non-polar column, isothermal

Data compiled by: NIST Mass Spectrometry Data Center, William E. Wallace, director

Column type PackedPackedPackedCapillaryCapillary
Active phase SqualaneSqualaneSqualaneSqualaneSqualane
Column length (m)    100.100.
Carrier gas
Substrate
Column diameter (mm)    0.250.25
Phase thickness (μm)
Temperature (C) 100.120.80.100.120.
I 987.991.982.987.991.
ReferenceBogoslovsky, Anvaer, et al., 1978Bogoslovsky, Anvaer, et al., 1978Bogoslovsky, Anvaer, et al., 1978Dielmann, Schwengers, et al., 1974Dielmann, Schwengers, et al., 1974
Comment MSDC-RI MSDC-RI MSDC-RI MSDC-RI MSDC-RI
Column type Capillary
Active phase Squalane
Column length (m) 100.
Carrier gas
Substrate
Column diameter (mm) 0.25
Phase thickness (μm)
Temperature (C) 80.
I 982.
ReferenceDielmann, Schwengers, et al., 1974
Comment MSDC-RI

References

Bogoslovsky, Anvaer, et al., 1978
Bogoslovsky, Yu.N.; Anvaer, B.I.; Vigdergauz, M.S., Chromatographic constants in gas chromatography (in Russian), Standards Publ. House, Moscow, 1978, 192. [all data]

Dielmann, Schwengers, et al., 1974
Dielmann, G.; Schwengers, D.; Schomburg, G., Gas-chromatographische Retentionsdaten und Strukture chemischer Verbindungen Gesättigte und ungesättigte alkylsubstituierte Cyclopentane und Methylcyclopentane, Chromatographia, 1974, 7, 5, 215-224, https://doi.org/10.1007/BF02321771 . [all data]