Nickel diisopropyldithiocarbamate

Kovats' RI, non-polar column, isothermal

View large format table.

Column type Active phase Temperature (C) I Reference Comment
PackedSE-30270.3229.Krupcik, Leclercq, et al., 1979Gas-Chrom Q; Column length: 2. m

References

Krupcik, Leclercq, et al., 1979
Krupcik, J.; Leclercq, P.A.; Garaj, J.; Masaryk, J., Analysis of Divalent Metal Dialkyldithiocarbamates by Gas Chromatography and Mass Spectrometry, J. Chromatogr., 1979, 171, 285-304, https://doi.org/10.1016/S0021-9673(01)95308-7 . [all data]