3-Deoxy-lyxo-hexonic acid, 1,4-lactone, TMS

Kovats' RI, non-polar column, isothermal

Data compiled by: NIST Mass Spectrometry Data Center, William E. Wallace, director

Column type Packed
Active phase OV-1
Column length (m) 2.
Carrier gas N2
Substrate Chromosorb G (100-120 mesh)
Column diameter (mm)
Phase thickness (μm)
Temperature (C) 160.
I 1808.
ReferencePetersson, 1977
Comment MSDC-RI

References

Petersson, 1977
Petersson, G., Retention Data in GLC Analysis; Carbohydrate-Related Hydroxy Carboxylic and Dicarboxylic Acids as Trimethylsilyl Derivatives, J. Chromatogr. Sci., 1977, 15, 7, 245-255, https://doi.org/10.1093/chromsci/15.7.245 . [all data]