2-C-Methylarabinonic acid, 1,4-lactone, TMS

Kovats' RI, non-polar column, isothermal

View large format table.

Column type Active phase Temperature (C) I Reference Comment
CapillarySE-54160.1653.Niemelä, 1996H2; Column length: 25. m; Column diameter: 0.32 mm
PackedOV-1160.1654.Petersson, 1977N2, Chromosorb G (100-120 mesh); Column length: 2. m

References

Niemelä, 1996
Niemelä, K., The formation of novel saccharinic acids, 2-C-(2-hydroxyethyl)tetronic acids, by alkaline degradation of leucrose, Carbohyd. Res., 1996, 285, 41-48, https://doi.org/10.1016/S0008-6215(96)90166-4 . [all data]

Petersson, 1977
Petersson, G., Retention Data in GLC Analysis; Carbohydrate-Related Hydroxy Carboxylic and Dicarboxylic Acids as Trimethylsilyl Derivatives, J. Chromatogr. Sci., 1977, 15, 7, 245-255, https://doi.org/10.1093/chromsci/15.7.245 . [all data]