FNO+

Vibrational and/or electronic energy levels

Data compiled by: Marilyn E. Jacox

State:   ?

 Energy
 (cm-1
 Med.   Transition   λmin
 (nm)
 λmax
 (nm)

References

To = 41870 ± 160 gas Frost, Lee, et al., 1975
Alderdice and Dixon, 1977

State:   ?

 Energy
 (cm-1
 Med.   Transition   λmin
 (nm)
 λmax
 (nm)

Tx = 14800 ± 1000 gas Frost, Lee, et al., 1975
Alderdice and Dixon, 1977

State:   X

Vib.
sym.
 No.   Approximate
 type of mode
 cm-1   Med.   Method   References

a' 2 Bend 590 ± 25 gas PE Alderdice and Dixon, 1977

Additional references: Jacox, 1994, page 93

Frost, Lee, et al., 1975
Frost, D.C.; Lee, S.T.; McDowell, C.A.; Westwood, N.P.C., Photoelectron spectroscopic studies of some nitrosyl and nitryl halides nitric acid, J. Electron Spectrosc. Relat. Phenom., 1975, 7, 331. [all data]

Alderdice and Dixon, 1977
Alderdice, R.S.; Dixon, R.N., J. Chem. Soc., 1977, Faraday Trans. 73, 245. [all data]

Jacox, 1994
Jacox, M.E., Vibrational and electronic energy levels of polyatomic transient molecules, American Chemical Society, Washington, DC, 1994, 464. [all data]