HCF2Cl+

Vibrational and/or electronic energy levels

Data compiled by: Marilyn E. Jacox

State:   G,H

 Energy
 (cm-1
 Med.   Transition   λmin
 (nm)
 λmax
 (nm)

References

Txx = 59870 ± 800 gas Doucet, Sauvageau, et al., 1973
Novak, Cvitas, et al., 1981

State:   F

 Energy
 (cm-1
 Med.   Transition   λmin
 (nm)
 λmax
 (nm)

Txx = 50910 ± 800 gas Doucet, Sauvageau, et al., 1973
Novak, Cvitas, et al., 1981

State:   C,D,E

 Energy
 (cm-1
 Med.   Transition   λmin
 (nm)
 λmax
 (nm)

Txx = 27270 ± 800 gas Doucet, Sauvageau, et al., 1973
Novak, Cvitas, et al., 1981

State:   B

 Energy
 (cm-1
 Med.   Transition   λmin
 (nm)
 λmax
 (nm)

Txx = 10890 ± 800 gas Doucet, Sauvageau, et al., 1973
Novak, Cvitas, et al., 1981

State:   X

Vib.
sym.
 No.   Approximate
 type of mode
 cm-1   Med.   Method   References

a' FCCl deform. 410 ± 80 gas PE Novak, Cvitas, et al., 1981

Additional references: Jacox, 1994, page 275

Doucet, Sauvageau, et al., 1973
Doucet, J.; Sauvageau, P.; Sandorfy, C., Vacuum ultraviolet and photoelectron spectra of fluoro-chloro derivatives of methane, J. Chem. Phys., 1973, 58, 3708. [all data]

Novak, Cvitas, et al., 1981
Novak, I.; Cvitas, T.; Klasinc, L.; Gusten, H., J. Chem. Soc., 1981, Faraday Trans. 2 77, 2049. [all data]

Jacox, 1994
Jacox, M.E., Vibrational and electronic energy levels of polyatomic transient molecules, American Chemical Society, Washington, DC, 1994, 464. [all data]