H(CC)2F+

Vibrational and/or electronic energy levels

Data compiled by: Marilyn E. Jacox

State:   F

 Energy
 (cm-1
 Med.   Transition   λmin
 (nm)
 λmax
 (nm)

References

Tx gas Bieri, Schmelzer, et al., 1980

State:   E

 Energy
 (cm-1
 Med.   Transition   λmin
 (nm)
 λmax
 (nm)

Tx = 89600 ± 1000 gas Bieri, Schmelzer, et al., 1980

State:   D

 Energy
 (cm-1
 Med.   Transition   λmin
 (nm)
 λmax
 (nm)

Tx = 75800 ± 1000 gas Bieri, Schmelzer, et al., 1980

State:   B,C

 Energy
 (cm-1
 Med.   Transition   λmin
 (nm)
 λmax
 (nm)

Tx = 61300 ± 1000 gas Bieri, Schmelzer, et al., 1980

State:   A

 Energy
 (cm-1
 Med.   Transition   λmin
 (nm)
 λmax
 (nm)

To = 20570 ± 160 gas Bieri, Schmelzer, et al., 1980

Vib.
sym.
 No.   Approximate
 type of mode
 cm-1   Med.   Method   References

Σ+ 3 CF stretch 1370 ± 80 gas PE Bieri, Schmelzer, et al., 1980
4 C-C stretch 705 ± 80 gas PE Bieri, Schmelzer, et al., 1980

State:   X

Vib.
sym.
 No.   Approximate
 type of mode
 cm-1   Med.   Method   References

Σ+ 2 CC stretch 2350 ± 80 gas PE Bieri, Schmelzer, et al., 1980
4 C-C stretch 685 ± 80 gas PE Bieri, Schmelzer, et al., 1980

Additional references: Jacox, 1994, page 339

Bieri, Schmelzer, et al., 1980
Bieri, G.; Schmelzer, A.; Asbrink, L.; Jonsson, M., Fluorine and the fluoroderivatives of acetylene and diacetylene studied by 30.4 nm He(II) photoelectron spectroscopy, Chem. Phys., 1980, 49, 213. [all data]

Jacox, 1994
Jacox, M.E., Vibrational and electronic energy levels of polyatomic transient molecules, American Chemical Society, Washington, DC, 1994, 464. [all data]