PF2NCO+

Vibrational and/or electronic energy levels

Data compiled by: Marilyn E. Jacox

State:   F

 Energy
 (cm-1
 Med.   Transition   λmin
 (nm)
 λmax
 (nm)

References

Txx = 67400 ± 1000 gas Cradock and Rankin, 1972

State:   E

 Energy
 (cm-1
 Med.   Transition   λmin
 (nm)
 λmax
 (nm)

Txx = 53700 ± 1000 gas Cradock and Rankin, 1972

State:   D

 Energy
 (cm-1
 Med.   Transition   λmin
 (nm)
 λmax
 (nm)

Txx = 44800 ± 1000 gas Cradock and Rankin, 1972

State:   C

 Energy
 (cm-1
 Med.   Transition   λmin
 (nm)
 λmax
 (nm)

Txx = 38300 ± 1000 gas Cradock and Rankin, 1972

State:   B

 Energy
 (cm-1
 Med.   Transition   λmin
 (nm)
 λmax
 (nm)

Txx = 17300 ± 1000 gas Cradock and Rankin, 1972

State:   A

 Energy
 (cm-1
 Med.   Transition   λmin
 (nm)
 λmax
 (nm)

Txx = 9280 ± 1000 gas Cradock and Rankin, 1972

Additional references: Jacox, 1994, page 349

Cradock and Rankin, 1972
Cradock, S.; Rankin, D.W.H., J. Chem. Soc., 1972, Faraday Trans. 2 68, 940. [all data]

Jacox, 1994
Jacox, M.E., Vibrational and electronic energy levels of polyatomic transient molecules, American Chemical Society, Washington, DC, 1994, 464. [all data]