CF2ClNO+

Vibrational and/or electronic energy levels

Data compiled by: Marilyn E. Jacox

State:   ?

 Energy
 (cm-1
 Med.   Transition   λmin
 (nm)
 λmax
 (nm)

References

Txx = 68100 ± 320 gas Ernsting, Pfab, et al., 1980

State:   ?

 Energy
 (cm-1
 Med.   Transition   λmin
 (nm)
 λmax
 (nm)

Txx = 50700 ± 1000 gas Ernsting, Pfab, et al., 1980

State:   ?

 Energy
 (cm-1
 Med.   Transition   λmin
 (nm)
 λmax
 (nm)

Txx = 45100 ± 1000 gas Ernsting, Pfab, et al., 1980

State:   ?

 Energy
 (cm-1
 Med.   Transition   λmin
 (nm)
 λmax
 (nm)

Txx = 36070 ± 320 gas Ernsting, Pfab, et al., 1980

State:   ?

 Energy
 (cm-1
 Med.   Transition   λmin
 (nm)
 λmax
 (nm)

Txx = 17990 ± 320 gas Ernsting, Pfab, et al., 1980

Additional references: Jacox, 1994, page 353

Ernsting, Pfab, et al., 1980
Ernsting, N.P.; Pfab, J.; Green, J.C.; Romelt, J., J. Chem. Soc., 1980, Faraday Trans. 2 76, 844. [all data]

Jacox, 1994
Jacox, M.E., Vibrational and electronic energy levels of polyatomic transient molecules, American Chemical Society, Washington, DC, 1994, 464. [all data]