Br3PS+

Vibrational and/or electronic energy levels

Data compiled by: Marilyn E. Jacox

State:   F

 Energy
 (cm-1
 Med.   Transition   λmin
 (nm)
 λmax
 (nm)

References

Tx = 42520 ± 320 gas Cox, Evans, et al., 1972
Bunzli, Frost, et al., 1972
Berkosky, Ellison, et al., 1973

State:   E

 Energy
 (cm-1
 Med.   Transition   λmin
 (nm)
 λmax
 (nm)

To = 34450 ± 320 gas Cox, Evans, et al., 1972
Bunzli, Frost, et al., 1972
Berkosky, Ellison, et al., 1973

State:   D

 Energy
 (cm-1
 Med.   Transition   λmin
 (nm)
 λmax
 (nm)

Tx = 22510 ± 320 gas Cox, Evans, et al., 1972
Bunzli, Frost, et al., 1972
Berkosky, Ellison, et al., 1973

State:   C

 Energy
 (cm-1
 Med.   Transition   λmin
 (nm)
 λmax
 (nm)

Tx = 19530 ± 320 gas Cox, Evans, et al., 1972
Bunzli, Frost, et al., 1972
Berkosky, Ellison, et al., 1973

State:   B

 Energy
 (cm-1
 Med.   Transition   λmin
 (nm)
 λmax
 (nm)

Tx = 15170 ± 320 gas Cox, Evans, et al., 1972
Bunzli, Frost, et al., 1972
Berkosky, Ellison, et al., 1973

State:   A

 Energy
 (cm-1
 Med.   Transition   λmin
 (nm)
 λmax
 (nm)

Tx = 12180 ± 320 gas Cox, Evans, et al., 1972
Bunzli, Frost, et al., 1972
Berkosky, Ellison, et al., 1973

Additional references: Jacox, 1994, page 299

Cox, Evans, et al., 1972
Cox, P.A.; Evans, S.; Orchard, A.F.; Richardson, N.V.; Roberts, P.J., Simple quantitative molecular orbital methods used in connection with photoelectron spectroscopy, Faraday Discuss. Chem. Soc., 1972, 54, 26. [all data]

Bunzli, Frost, et al., 1972
Bunzli, J.C.; Frost, D.C.; McDowell, C.A., Photoelectron spectra of phosphoryl and thiophosphoryl chlorides and bromides, J. Electron Spectrosc. Relat. Phenom., 1972, 1, 5, 481, https://doi.org/10.1016/0368-2048(72)80018-5 . [all data]

Berkosky, Ellison, et al., 1973
Berkosky, J.L.; Ellison, F.O.; Lee, T.H.; Rabalais, J.W., Model for calculating spin-orbit interactions with applications to photoelectron spectroscopy, J. Chem. Phys., 1973, 59, 5342. [all data]

Jacox, 1994
Jacox, M.E., Vibrational and electronic energy levels of polyatomic transient molecules, American Chemical Society, Washington, DC, 1994, 464. [all data]