BrNCO+

Vibrational and/or electronic energy levels

Data compiled by: Marilyn E. Jacox

State:   F

 Energy
 (cm-1
 Med.   Transition   λmin
 (nm)
 λmax
 (nm)

References

Tx = 62040 ± 240 gas Frost, MacDonald, et al., 1980

Vib.
sym.
 No.   Approximate
 type of mode
 cm-1   Med.   Method   References

a' 750 ± 80 gas PE Frost, MacDonald, et al., 1980

State:   E

 Energy
 (cm-1
 Med.   Transition   λmin
 (nm)
 λmax
 (nm)

Tx = 53740 ± 240 gas Frost, MacDonald, et al., 1980

State:   D

 Energy
 (cm-1
 Med.   Transition   λmin
 (nm)
 λmax
 (nm)

Tx = 44540 ± 240 gas Frost, MacDonald, et al., 1980

State:   C

 Energy
 (cm-1
 Med.   Transition   λmin
 (nm)
 λmax
 (nm)

Tx = 22190 ± 240 gas Frost, MacDonald, et al., 1980

State:   B

 Energy
 (cm-1
 Med.   Transition   λmin
 (nm)
 λmax
 (nm)

Tx = 20820 ± 240 gas Frost, MacDonald, et al., 1980

State:   A

 Energy
 (cm-1
 Med.   Transition   λmin
 (nm)
 λmax
 (nm)

Tx = 5970 ± 240 gas Frost, MacDonald, et al., 1980

State:   X

Vib.
sym.
 No.   Approximate
 type of mode
 cm-1   Med.   Method   References

a' 1100 ± 40 gas PE Frost, MacDonald, et al., 1980
520 ± 40 gas PE Frost, MacDonald, et al., 1980

Additional references: Jacox, 1994, page 193

Frost, MacDonald, et al., 1980
Frost, D.C.; MacDonald, C.B.; McDowell, C.A.; Westwood, N.P.C., The HeI photoelectron spectra of the halogen azides, XN3(X=Cl and Br) and the halogen isocyanates, XNCO(X=Cl, Br and I), Chem. Phys., 1980, 47, 111. [all data]

Jacox, 1994
Jacox, M.E., Vibrational and electronic energy levels of polyatomic transient molecules, American Chemical Society, Washington, DC, 1994, 464. [all data]