INCO+

Vibrational and/or electronic energy levels

Data compiled by: Marilyn E. Jacox

State:   F

 Energy
 (cm-1
 Med.   Transition   λmin
 (nm)
 λmax
 (nm)

References

Tx = 61800 ± 240 gas Frost, MacDonald, et al., 1980

State:   E

 Energy
 (cm-1
 Med.   Transition   λmin
 (nm)
 λmax
 (nm)

Tx = 52440 ± 240 gas Frost, MacDonald, et al., 1980

State:   D

 Energy
 (cm-1
 Med.   Transition   λmin
 (nm)
 λmax
 (nm)

Tx = 46070 ± 240 gas Frost, MacDonald, et al., 1980

State:   C

 Energy
 (cm-1
 Med.   Transition   λmin
 (nm)
 λmax
 (nm)

Tx = 21300 ± 240 gas Frost, MacDonald, et al., 1980

State:   B

 Energy
 (cm-1
 Med.   Transition   λmin
 (nm)
 λmax
 (nm)

Tx = 18320 ± 240 gas Frost, MacDonald, et al., 1980

State:   A

 Energy
 (cm-1
 Med.   Transition   λmin
 (nm)
 λmax
 (nm)

Tx = 5570 ± 240 gas Frost, MacDonald, et al., 1980

State:   X

Vib.
sym.
 No.   Approximate
 type of mode
 cm-1   Med.   Method   References

a' 2070 ± 40 gas PE Frost, MacDonald, et al., 1980
420 ± 40 gas PE Frost, MacDonald, et al., 1980

Additional references: Jacox, 1994, page 193

Frost, MacDonald, et al., 1980
Frost, D.C.; MacDonald, C.B.; McDowell, C.A.; Westwood, N.P.C., The HeI photoelectron spectra of the halogen azides, XN3(X=Cl and Br) and the halogen isocyanates, XNCO(X=Cl, Br and I), Chem. Phys., 1980, 47, 111. [all data]

Jacox, 1994
Jacox, M.E., Vibrational and electronic energy levels of polyatomic transient molecules, American Chemical Society, Washington, DC, 1994, 464. [all data]