FSO3+

Vibrational and/or electronic energy levels

Data compiled by: Marilyn E. Jacox

State:   D

 Energy
 (cm-1
 Med.   Transition   λmin
 (nm)
 λmax
 (nm)

References

Txx = 53700 ± 1200 gas Cornford, Frost, et al., 1972

State:   C

 Energy
 (cm-1
 Med.   Transition   λmin
 (nm)
 λmax
 (nm)

Txx = 40700 ± 1200 gas Cornford, Frost, et al., 1972

Vib.
sym.
 No.   Approximate
 type of mode
 cm-1   Med.   Method   References

a1 1 SO3 s-stretch 920 ± 40 gas PE Cornford, Frost, et al., 1972
3 SO3 umbrella 550 ± 40 gas PE Cornford, Frost, et al., 1972

State:   B

 Energy
 (cm-1
 Med.   Transition   λmin
 (nm)
 λmax
 (nm)

Txx = 17300 ± 1200 gas Cornford, Frost, et al., 1972

Vib.
sym.
 No.   Approximate
 type of mode
 cm-1   Med.   Method   References

a1 850 ± 40 gas PE Cornford, Frost, et al., 1972

State:   A

 Energy
 (cm-1
 Med.   Transition   λmin
 (nm)
 λmax
 (nm)

Txx = 10100 ± 1200 gas Cornford, Frost, et al., 1972

State:   X

Vib.
sym.
 No.   Approximate
 type of mode
 cm-1   Med.   Method   References

a1 1 SO3 s-stretch 1220 ± 40 gas PE Cornford, Frost, et al., 1972

Additional references: Jacox, 1994, page 289

Cornford, Frost, et al., 1972
Cornford, A.B.; Frost, D.C.; Herring, F.G.; McDowell, C.A., J. Chem. Soc., 1972, Faraday Disc. 54, 56. [all data]

Jacox, 1994
Jacox, M.E., Vibrational and electronic energy levels of polyatomic transient molecules, American Chemical Society, Washington, DC, 1994, 464. [all data]