ClONO2+

Vibrational and/or electronic energy levels

Data compiled by: Marilyn E. Jacox

State:   ?

 Energy
 (cm-1
 Med.   Transition   λmin
 (nm)
 λmax
 (nm)

References

Txx = 58250 ± 120 gas Wang, Li, et al., 1996

State:   ?

 Energy
 (cm-1
 Med.   Transition   λmin
 (nm)
 λmax
 (nm)

Txx = 36630 ± 120 gas Wang, Li, et al., 1996

State:   E

 Energy
 (cm-1
 Med.   Transition   λmin
 (nm)
 λmax
 (nm)

Txx = 25170 ± 120 gas Wang, Li, et al., 1996

State:   D

 Energy
 (cm-1
 Med.   Transition   λmin
 (nm)
 λmax
 (nm)

Txx = 18640 ± 120 gas Wang, Li, et al., 1996

State:   B,C

 Energy
 (cm-1
 Med.   Transition   λmin
 (nm)
 λmax
 (nm)

Txx = 11130 ± 120 gas Wang, Li, et al., 1996

Vib.
sym.
 No.   Approximate
 type of mode
 cm-1   Med.   Method   References

a' 545 ± 50 gas PE Wang, Li, et al., 1996
415 ± 50 gas PE Wang, Li, et al., 1996

State:   A

 Energy
 (cm-1
 Med.   Transition   λmin
 (nm)
 λmax
 (nm)

Txx = 4680 ± 120 gas Wang, Li, et al., 1996

Vib.
sym.
 No.   Approximate
 type of mode
 cm-1   Med.   Method   References

a' 770 ± 50 gas PE Wang, Li, et al., 1996

State:   X

Vib.
sym.
 No.   Approximate
 type of mode
 cm-1   Med.   Method   References

a' 1240 ± 60 gas PE Wang, Li, et al., 1996

Additional references: Jacox, 1998, page 301

Wang, Li, et al., 1996
Wang, D.; Li, Y.; Jiang, P.; Wang, X.; Chen, B., The study of HeI photoelectron spectroscopy (PES) of the electronic structure for ClONO2, Chem. Phys. Lett., 1996, 260, 99. [all data]

Jacox, 1998
Jacox, M.E., Vibrational and electronic energy levels of polyatomic transient molecules: supplement A, J. Phys. Chem. Ref. Data, 1998, 27, 2, 115-393, https://doi.org/10.1063/1.556017 . [all data]