NCCNO+

Vibrational and/or electronic energy levels

Data compiled by: Marilyn E. Jacox

State:   D

 Energy
 (cm-1
 Med.   Transition   λmin
 (nm)
 λmax
 (nm)

References

Txx = 60270 ± 430 gas Pasinszki and Westwood, 1996

Vib.
sym.
 No.   Approximate
 type of mode
 cm-1   Med.   Method   References

Σ+ 1030 ± 150 gas PE Pasinszki and Westwood, 1996

State:   C

 Energy
 (cm-1
 Med.   Transition   λmin
 (nm)
 λmax
 (nm)

Txx = 46800 ± 430 gas Pasinszki and Westwood, 1996

State:   B

 Energy
 (cm-1
 Med.   Transition   λmin
 (nm)
 λmax
 (nm)

Txx = 22750 ± 280 gas Pasinszki and Westwood, 1996

State:   A

 Energy
 (cm-1
 Med.   Transition   λmin
 (nm)
 λmax
 (nm)

Txx = 20740 ± 280 gas Pasinszki and Westwood, 1996

State:   X

Vib.
sym.
 No.   Approximate
 type of mode
 cm-1   Med.   Method   References

Σ+ 2200 ± 150 gas PE Pasinszki and Westwood, 1996
1630 ± 150 gas PE Pasinszki and Westwood, 1996

Additional references: Jacox, 1998, page 295

Pasinszki and Westwood, 1996
Pasinszki, T.; Westwood, N.P.C., Ground, Excited, and Ionic States of the NCCNO Molecule: A HeI Photoelectron, Infrared, Ultraviolet, and, J. Phys. Chem., 1996, 100, 42, 16586, https://doi.org/10.1021/jp9617938 . [all data]

Jacox, 1998
Jacox, M.E., Vibrational and electronic energy levels of polyatomic transient molecules: supplement A, J. Phys. Chem. Ref. Data, 1998, 27, 2, 115-393, https://doi.org/10.1063/1.556017 . [all data]