SeF2+

Vibrational and/or electronic energy levels

Data compiled by: Marilyn E. Jacox

State:   X

Vib.
sym.
 No.   Approximate
 type of mode
 cm-1   Med.   Method   References

a1 1 Sym. stretch 780 ± 50 gas PE de Leeuw, Mooyman, et al., 1979

Additional references: Jacox, 1994, page 112

References

de Leeuw, Mooyman, et al., 1979
de Leeuw, D.M.; Mooyman, R.; de Lange, C.A., He(I) photoelectron spectroscopy of transient species: The SeX2 molecules (X = F, Cl and Br), Chem. Phys., 1979, 38, 1, 21, https://doi.org/10.1016/0301-0104(79)85048-X . [all data]

Jacox, 1994
Jacox, M.E., Vibrational and electronic energy levels of polyatomic transient molecules, American Chemical Society, Washington, DC, 1994, 464. [all data]