SiH3I+

Vibrational and/or electronic energy levels

Data compiled by: Marilyn E. Jacox

State:   B

 Energy
 (cm-1
 Med.   Transition   λmin
 (nm)
 λmax
 (nm)

References

Txx = 24400 ± 1000 gas Cradock and Whiteford, 1971

State:   A

 Energy
 (cm-1
 Med.   Transition   λmin
 (nm)
 λmax
 (nm)

Txx = 18230 ± 320 gas Cradock and Whiteford, 1971

Additional references: Jacox, 1994, page 241

Cradock and Whiteford, 1971
Cradock, S.; Whiteford, R.A., Photo-electron spectra of the mono and dihalo silanes and germanes, J. Chem. Soc. Faraday Trans., 1971, 67, 3425. [all data]

Jacox, 1994
Jacox, M.E., Vibrational and electronic energy levels of polyatomic transient molecules, American Chemical Society, Washington, DC, 1994, 464. [all data]