S2Br2+

Vibrational and/or electronic energy levels

Data compiled by: Marilyn E. Jacox

State:   H

 Energy
 (cm-1
 Med.   Transition   λmin
 (nm)
 λmax
 (nm)

References

Tx = 43300 ± 1000 gas Colton and Rabalais, 1974
Solouki and Bock, 1977

State:   G

 Energy
 (cm-1
 Med.   Transition   λmin
 (nm)
 λmax
 (nm)

Tx = 34370 ± 400 gas Colton and Rabalais, 1974
Solouki and Bock, 1977

State:   F

 Energy
 (cm-1
 Med.   Transition   λmin
 (nm)
 λmax
 (nm)

Tx = 31200 T gas Colton and Rabalais, 1974
Solouki and Bock, 1977

State:   E

 Energy
 (cm-1
 Med.   Transition   λmin
 (nm)
 λmax
 (nm)

Tx = 20700 ± 1000 gas Colton and Rabalais, 1974
Solouki and Bock, 1977

State:   D

 Energy
 (cm-1
 Med.   Transition   λmin
 (nm)
 λmax
 (nm)

Tx = 19100 ± 1000 gas Colton and Rabalais, 1974
Solouki and Bock, 1977

State:   C

 Energy
 (cm-1
 Med.   Transition   λmin
 (nm)
 λmax
 (nm)

Tx = 15980 ± 400 gas Colton and Rabalais, 1974
Solouki and Bock, 1977

State:   B

 Energy
 (cm-1
 Med.   Transition   λmin
 (nm)
 λmax
 (nm)

Tx = 12590 ± 400 gas Colton and Rabalais, 1974
Solouki and Bock, 1977

State:   A

 Energy
 (cm-1
 Med.   Transition   λmin
 (nm)
 λmax
 (nm)

Tx = 5000 ± 400 gas Colton and Rabalais, 1974
Solouki and Bock, 1977

Additional references: Jacox, 1994, page 224; Kaufel, Vahl, et al., 1981

Colton and Rabalais, 1974
Colton, R.J.; Rabalais, J.W., Photoelectron electronic absorption spectra of SCl2, S2Cl2, S2Br2 and (CH3)2S2, J. Electron Spectrosc. Relat. Phenom., 1974, 3, 345. [all data]

Solouki and Bock, 1977
Solouki, B.; Bock, H., Photoelectron spectra and molecular properties. 59. Ionization energies of disulfur dihalides and isomerization surfaces XSSX .dblarw. SSX2, Inorg. Chem., 1977, 16, 3, 665, https://doi.org/10.1021/ic50169a035 . [all data]

Jacox, 1994
Jacox, M.E., Vibrational and electronic energy levels of polyatomic transient molecules, American Chemical Society, Washington, DC, 1994, 464. [all data]

Kaufel, Vahl, et al., 1981
Kaufel, R.; Vahl, G.; Minkwitz, R.; Baumgartel, H., Die photoionenspektren von SCl2, S2Cl2 und S2Br2, Z. Anorg. Allg. Chem., 1981, 481, 207. [all data]