t-(NO)2-

Vibrational and/or electronic energy levels

Data compiled by: Marilyn E. Jacox

State:   ?

 Energy
 (cm-1
 Med.   Transition   λmin
 (nm)
 λmax
 (nm)

References

Txxd = 23640 ± 400 gas Tsukuda, Saeki, et al., 1998

State:   ?

 Energy
 (cm-1
 Med.   Transition   λmin
 (nm)
 λmax
 (nm)

Td = 18800 U gas Posey and Johnson, 1988

State:   X

Vib.
sym.
 No.   Approximate
 type of mode
 cm-1   Med.   Method   References

bu 5 Asym. stretch 1227.5 Ne IR Lugez, Thompson, et al., 1999
Andrews and Zhou, 1999
5 Asym. stretch 1221.0 Ar IR Andrews, Zhou, et al., 1998
Andrews and Zhou, 1999, 2

Additional references: Jacox, 1994, page 207; Jacox, 1998, page 257; Jacox, 2003, page 236

Tsukuda, Saeki, et al., 1998
Tsukuda, T.; Saeki, M.; Zhu, L.; Nagata, T., Formation of N3O3- anion in (NO)n-: photoelectron spectroscopy and ab initio calculations, Chem. Phys. Lett., 1998, 295, 5-6, 416, https://doi.org/10.1016/S0009-2614(98)01002-1 . [all data]

Posey and Johnson, 1988
Posey, L.A.; Johnson, M.A., Pulsed photoelectron spectroscopy of negative cluster ions: Isolation of three distinguishable forms of N2O-2, J. Chem. Phys., 1988, 88, 9, 5383, https://doi.org/10.1063/1.454576 . [all data]

Lugez, Thompson, et al., 1999
Lugez, C.L.; Thompson, W.E.; Jacox, M.E.; Snis, A.; Panas, I., Infrared spectra of (NO)[sub 2][sup +], (NO)[sub 2][sup -], and (NO)[sub 3][sup -] trapped in solid neon, J. Chem. Phys., 1999, 110, 21, 10345, https://doi.org/10.1063/1.478967 . [all data]

Andrews and Zhou, 1999
Andrews, L.; Zhou, M., Infrared spectra of (NO)[sub 2][sup -] and (NO)[sub 2][sup +] isomers trapped in solid neon, J. Chem. Phys., 1999, 111, 13, 6036, https://doi.org/10.1063/1.479900 . [all data]

Andrews, Zhou, et al., 1998
Andrews, L.; Zhou, M.; Willson, S.P.; Kushto, G.P.; Snis, A.; Panas, I., Infrared spectra of cis and trans-(NO)[sub 2][sup -] anions in solid argon, J. Chem. Phys., 1998, 109, 1, 177, https://doi.org/10.1063/1.476547 . [all data]

Andrews and Zhou, 1999, 2
Andrews, L.; Zhou, M., Reactions of Laser-Ablated Molybdenum and Tungsten Atoms with Nitric Oxide. Infrared Spectra of the MN, NMO, and M-η, J. Phys. Chem. A, 1999, 103, 21, 4167, https://doi.org/10.1021/jp990328i . [all data]

Jacox, 1994
Jacox, M.E., Vibrational and electronic energy levels of polyatomic transient molecules, American Chemical Society, Washington, DC, 1994, 464. [all data]

Jacox, 1998
Jacox, M.E., Vibrational and electronic energy levels of polyatomic transient molecules: supplement A, J. Phys. Chem. Ref. Data, 1998, 27, 2, 115-393, https://doi.org/10.1063/1.556017 . [all data]

Jacox, 2003
Jacox, M.E., Vibrational and electronic energy levels of polyatomic transient molecules: supplement B, J. Phys. Chem. Ref. Data, 2003, 32, 1, 1-441, https://doi.org/10.1063/1.1497629 . [all data]