OZrO-

Vibrational and/or electronic energy levels

Data compiled by: Marilyn E. Jacox

State:   ?

 Energy
 (cm-1
 Med.   Transition   λmin
 (nm)
 λmax
 (nm)

References

Td = 13230 ± 240 gas Thomas, Xu, et al., 1999
Zheng, Bowen, et al., 2005

State:   X

Vib.
sym.
 No.   Approximate
 type of mode
 cm-1   Med.   Method   References

b2 3 Asym. stretch 761.4 Ar IR Chertihin and Andrews, 1995

Additional references: Jacox, 1998, page 182; Jacox, 2003, page 117

Thomas, Xu, et al., 1999
Thomas, O.C.; Xu, S.; Lippa, T.P.; Bowen, K.H., J. Cluster Sci., 1999, 10, 4, 525, https://doi.org/10.1023/A:1021905024705 . [all data]

Zheng, Bowen, et al., 2005
Zheng, W.; Bowen, K.H., Jr.; Li, J.; Dabkowska, I.; Gutowski, M., Electronic Structure Differences in ZrO, J. Phys. Chem. A, 2005, 109, 50, 11521, https://doi.org/10.1021/jp053593e . [all data]

Chertihin and Andrews, 1995
Chertihin, G.V.; Andrews, L., Reactions of Laser Ablated Titanium, Zirconium, and Hafnium Atoms with Oxygen Molecules in Condensing Argon, J. Phys. Chem., 1995, 99, 17, 6356, https://doi.org/10.1021/j100017a015 . [all data]

Jacox, 1998
Jacox, M.E., Vibrational and electronic energy levels of polyatomic transient molecules: supplement A, J. Phys. Chem. Ref. Data, 1998, 27, 2, 115-393, https://doi.org/10.1063/1.556017 . [all data]

Jacox, 2003
Jacox, M.E., Vibrational and electronic energy levels of polyatomic transient molecules: supplement B, J. Phys. Chem. Ref. Data, 2003, 32, 1, 1-441, https://doi.org/10.1063/1.1497629 . [all data]