3-Chloroheptane

Reaction thermochemistry data

Data compiled by: Hussein Y. Afeefy, Joel F. Liebman, and Stephen E. Stein

Individual Reactions

Heptane, 4-chloro- = 3-Chloroheptane

By formula: C7H15Cl = C7H15Cl

Quantity Value Units Method Reference Comment
Δr-0.055 ± 0.025kcal/molEqkKabo, Andreevskii, et al., 1967gas phase; Heat of isomerization

Heptane, 2-chloro- = 3-Chloroheptane

By formula: C7H15Cl = C7H15Cl

Quantity Value Units Method Reference Comment
Δr0.035kcal/molCisoRoganov, Kabo, et al., 1969liquid phase

References

Kabo, Andreevskii, et al., 1967
Kabo, G.Ya.; Andreevskii, D.N.; Savinetskaya, G.A., Isomerization equilibrium of n-monochloroheptanes and n-heptenes, Neftekhimiya, 1967, 7, 364-368. [all data]

Roganov, Kabo, et al., 1969
Roganov, G.N.; Kabo, G.Ya.; Adreevskii, D.N., Additivity of thermochemical properties for isomers of secondary n-alkane chlorides (C5-C10), J. Org. Chem. USSR (Engl. Transl.), 1969, 5, 2037-2041. [all data]