Octanoylamide deferoxamine

Phase change data

Data compiled by: William E. Acree, Jr., James S. Chickos

Enthalpy of fusion

ΔfusH (kJ/mol) Temperature (K) Method Reference
130.7455.3DSCIhnat, Vennerstrom, et al., 2000

References

Ihnat, Vennerstrom, et al., 2000
Ihnat, Peter M.; Vennerstrom, Jonathan L.; Robinson, Dennis H., Synthesis and solution properties of deferoxamine amides, J. Pharm. Sci., 2000, 89, 12, 1525-1536, https://doi.org/10.1002/1520-6017(200012)89:12<1525::AID-JPS3>3.0.CO;2-T . [all data]