Trimethyl thioborate

Phase change data

Data compiled by: William E. Acree, Jr., James S. Chickos

Quantity Value Units Method Reference Comment
Δvap54.0 ± 0.8kJ/molN/AFinch, Gardner, et al., 1967Based on data from 303. - 493. K.

Enthalpy of vaporization

ΔvapH (kJ/mol) Temperature (K) Reference Comment
44.9394.Dykyj, Svoboda, et al., 1999Based on data from 325. - 462. K.
51.6398.Finch, Gardner, et al., 1967Based on data from 303. - 493. K.

Gas phase ion energetics data

Data compiled as indicated in comments:
LLK - Sharon G. Lias, Rhoda D. Levin, and Sherif A. Kafafi
RDSH - Henry M. Rosenstock, Keith Draxl, Bruce W. Steiner, and John T. Herron

Ionization energy determinations

IE (eV) Method Reference Comment
9.24EILappert, Litzow, et al., 1970RDSH
8.74PEKroner, Nolle, et al., 1973Vertical value; LLK

References

Finch, Gardner, et al., 1967
Finch, Arthur; Gardner, P.J.; Pearn, E.J.; Watts, G.B., Thermochemistry of triphenylboron, tricyclohexylboron and some phenylboron halides, Trans. Faraday Soc., 1967, 63, 1880, https://doi.org/10.1039/tf9676301880 . [all data]

Dykyj, Svoboda, et al., 1999
Dykyj, J.; Svoboda, J.; Wilhoit, R.C.; Frenkel, M.L.; Hall, K.R., Vapor Pressure of Chemicals: Part A. Vapor Pressure and Antoine Constants for Hydrocarbons and Sulfur, Selenium, Tellurium and Hydrogen Containing Organic Compounds, Springer, Berlin, 1999, 373. [all data]