C10H5F3N2

Reaction thermochemistry data

Data compiled by: John E. Bartmess

Individual Reactions

C10H4F3N2- + Hydrogen cation = C10H5F3N2

By formula: C10H4F3N2- + H+ = C10H5F3N2

Quantity Value Units Method Reference Comment
Δr312.7 ± 2.3kcal/molG+TSKoppel, Taft, et al., 1994gas phase
Quantity Value Units Method Reference Comment
Δr307.0 ± 2.0kcal/molIMREKoppel, Taft, et al., 1994gas phase

Gas phase ion energetics data

Data compiled by: John E. Bartmess

De-protonation reactions

C10H4F3N2- + Hydrogen cation = C10H5F3N2

By formula: C10H4F3N2- + H+ = C10H5F3N2

Quantity Value Units Method Reference Comment
Δr312.7 ± 2.3kcal/molG+TSKoppel, Taft, et al., 1994gas phase
Quantity Value Units Method Reference Comment
Δr307.0 ± 2.0kcal/molIMREKoppel, Taft, et al., 1994gas phase

References

Koppel, Taft, et al., 1994
Koppel, I.A.; Taft, R.W.; Anvia, F.; Zhu, S.Z.; Hu, L.Q.; Sung, K.S.; Desmarteau, D.D.; Yagupolskii, L.M., The Gas-Phase Acidities of Very Strong Neutral Bronsted Acids, J. Am. Chem. Soc., 1994, 116, 7, 3047, https://doi.org/10.1021/ja00086a038 . [all data]