1,3-Benzenedicarbonyl dichloride

Condensed phase thermochemistry data

Data compiled by: Hussein Y. Afeefy, Joel F. Liebman, and Stephen E. Stein

Quantity Value Units Method Reference Comment
Δfsolid-322.0 ± 2.0kJ/molCcbKaryakin, Rabinovich, et al., 1978
Δfsolid-365.kJ/molCcbSapozhnikov, Mochalov, et al., 1973
Quantity Value Units Method Reference Comment
Δcsolid-3397.7 ± 2.0kJ/molCcbKaryakin, Rabinovich, et al., 1978
Δcsolid-3400. ± 3.kJ/molCcbSapozhnikov, Mochalov, et al., 1973

Phase change data

Data compiled as indicated in comments:
BS - Robert L. Brown and Stephen E. Stein
AC - William E. Acree, Jr., James S. Chickos

Quantity Value Units Method Reference Comment
Tboil549.2KN/AWeast and Grasselli, 1989BS

Enthalpy of vaporization

ΔvapH (kJ/mol) Temperature (K) Method Reference Comment
61.5458.AStephenson and Malanowski, 1987Based on data from 443. - 550. K. See also Dykyj, Svoboda, et al., 1999.; AC

References

Karyakin, Rabinovich, et al., 1978
Karyakin, N.V.; Rabinovich, I.B.; Sokolov, L.B., Thermodynamics of the synthesis of isomeric poly(phenylenephthalamides), Vysokomol. Soedin. Ser. B, 1978, 20, 662-666. [all data]

Sapozhnikov, Mochalov, et al., 1973
Sapozhnikov, V.N.; Mochalov, A.N.; Karyakin, N.V.; Kunyavskaya, S.G.; Chernova, V.I.; Rabinovich, I.B., Low-temperature heat capacity and thermodynamic properties of some acid dichlorides, Tr. Khim. Khim. Tekhnol., 1973, 55-57. [all data]

Weast and Grasselli, 1989
CRC Handbook of Data on Organic Compounds, 2nd Editon, Weast,R.C and Grasselli, J.G., ed(s)., CRC Press, Inc., Boca Raton, FL, 1989, 1. [all data]

Stephenson and Malanowski, 1987
Stephenson, Richard M.; Malanowski, Stanislaw, Handbook of the Thermodynamics of Organic Compounds, 1987, https://doi.org/10.1007/978-94-009-3173-2 . [all data]

Dykyj, Svoboda, et al., 1999
Dykyj, J.; Svoboda, J.; Wilhoit, R.C.; Frenkel, M.L.; Hall, K.R., Vapor Pressure of Chemicals: Part A. Vapor Pressure and Antoine Constants for Hydrocarbons and Sulfur, Selenium, Tellurium and Hydrogen Containing Organic Compounds, Springer, Berlin, 1999, 373. [all data]