Silane, chlorotripropyl-

Phase change data

Data compiled by: Robert L. Brown and Stephen E. Stein

Quantity Value Units Method Reference Comment
Tboil472. - 474.KN/APCR Inc., 1990

Kovats' RI, non-polar column, isothermal

View large format table.

Column type Active phase Temperature (C) I Reference Comment
PackedSE-30140.984.Kirichenko, Markov, et al., 1975Ar; Column length: 1. m
PackedSE-3070.980.Kirichenko, Markov, et al., 1975Ar; Column length: 1. m

References

PCR Inc., 1990
PCR Inc., Research Chemicals Catalog 1990-1991, PCR Inc., Gainesville, FL, 1990, 1. [all data]

Kirichenko, Markov, et al., 1975
Kirichenko, É.A.; Markov, B.A.; Kochetov, V.A.; Kuznetsova, T.I., Chromatographic retention indices of alkylchlorosilanes, Zh. Anal. Khim., 1975, 30, 6, 1038-1040. [all data]