Silane, chlorotriethyl-

Phase change data

Data compiled as indicated in comments:
BS - Robert L. Brown and Stephen E. Stein
AC - William E. Acree, Jr., James S. Chickos

Quantity Value Units Method Reference Comment
Tboil417. - 418.KN/APCR Inc., 1990BS

Enthalpy of vaporization

ΔvapH (kJ/mol) Temperature (K) Reference Comment
42.9419.Stull, 1947Based on data from 268. - 419. K.; AC

Antoine Equation Parameters

log10(P) = A − (B / (T + C))
    P = vapor pressure (bar)
    T = temperature (K)

View plot Requires a JavaScript / HTML 5 canvas capable browser.

Temperature (K) A B C Reference Comment
268.3 - 419.54.378841662.88-39.14Stull, 1947Coefficents calculated by NIST from author's data.

Kovats' RI, non-polar column, isothermal

View large format table.

Column type Active phase Temperature (C) I Reference Comment
PackedSE-30140.904.Kirichenko, Markov, et al., 1975Ar; Column length: 1. m
PackedSE-3070.874.Kirichenko, Markov, et al., 1975Ar; Column length: 1. m
PackedPolymethylsiloxane, (PMS-20000)50.900.2Ainshtein and Shulyatieva, 1972He, Chromosorb W; Column length: 2. m

References

PCR Inc., 1990
PCR Inc., Research Chemicals Catalog 1990-1991, PCR Inc., Gainesville, FL, 1990, 1. [all data]

Stull, 1947
Stull, Daniel R., Vapor Pressure of Pure Substances. Organic and Inorganic Compounds, Ind. Eng. Chem., 1947, 39, 4, 517-540, https://doi.org/10.1021/ie50448a022 . [all data]

Kirichenko, Markov, et al., 1975
Kirichenko, É.A.; Markov, B.A.; Kochetov, V.A.; Kuznetsova, T.I., Chromatographic retention indices of alkylchlorosilanes, Zh. Anal. Khim., 1975, 30, 6, 1038-1040. [all data]

Ainshtein and Shulyatieva, 1972
Ainshtein, A.A.; Shulyatieva, T.I., Retention indices of alkyl- and arylchlorosilanes, Zh. Anal. Khim., 1972, 27, 816-821. [all data]