2-Pyridinecarboxylic acid

Condensed phase thermochemistry data

Data compiled by: Hussein Y. Afeefy, Joel F. Liebman, and Stephen E. Stein

Quantity Value Units Method Reference Comment
Δfsolid-82.17 ± 0.43kcal/molCcbGubareva, Bukhtoyarova, et al., 1990
Quantity Value Units Method Reference Comment
Δcsolid-568.06kcal/molCcbWood and Jones, 1963

Phase change data

Data compiled as indicated in comments:
AC - William E. Acree, Jr., James S. Chickos
DH - Eugene S. Domalski and Elizabeth D. Hearing

Quantity Value Units Method Reference Comment
Δsub22.2 ± 0.1kcal/molN/ASabbah and Ider, 1999AC
Δsub23.4 ± 0.55kcal/molMERibeiro da Silva, 1998Based on data from 345. - 392. K.; AC

Enthalpy of sublimation

ΔsubH (kcal/mol) Temperature (K) Method Reference Comment
21.7 ± 0.1329.CSabbah and Ider, 1999AC

Enthalpy of fusion

ΔfusH (kcal/mol) Temperature (K) Reference Comment
7.1702411.Allan, Geddes, et al., 1989DH
7.17411.Domalski and Hearing, 1996AC

References

Gubareva, Bukhtoyarova, et al., 1990
Gubareva, A.I.; Bukhtoyarova, I.A.; Gerasimov, P.A.; Gadzhiev, S.N., Physicochemical properties of α-picolinic acid, J. Appl. Chem. USSR, 1990, 63, 448-451. [all data]

Wood and Jones, 1963
Wood, J.L.; Jones, M.M., Heats of formation and coordinate bond energies of some nickel(II) chelates, J. Phys. Chem., 1963, 67, 1049-1051. [all data]

Sabbah and Ider, 1999
Sabbah, Raphaël; Ider, Safi, Energétique des liaisons inter- et intramoléculaires dans les trois acides carboxypyridiniques (acides picolinique, nicotinique et isonicotinique), Revue canadienne de chimie, 1999, 77, 2, 249-257, https://doi.org/10.1139/cjc-77-2-249 . [all data]

Ribeiro da Silva, 1998
Ribeiro da Silva, M., Enthalpies of combustion of the pyridine N-oxide derivatives: 4-methyl-, 3-cyano-, 4-cyano-, 3-hydroxy-, 2-carboxy-, 4-carboxy-, and 3-methyl-4-nitro, and of the pyridine derivatives: 2-carboxy-, and 4-carboxy-. The dissociation enthalpies of the N-O bonds, The Journal of Chemical Thermodynamics, 1998, 30, 7, 869-878, https://doi.org/10.1006/jcht.1998.0353 . [all data]

Allan, Geddes, et al., 1989
Allan, J.R.; Geddes, W.C.; Hindle, C.S.; Orr, A.E., Thermal analysis studies on pyridine carboxylic acid complexes of zinc(II), Thermochim. Acta, 1989, 153, 249-256. [all data]

Domalski and Hearing, 1996
Domalski, Eugene S.; Hearing, Elizabeth D., Heat Capacities and Entropies of Organic Compounds in the Condensed Phase. Volume III, J. Phys. Chem. Ref. Data, 1996, 25, 1, 1, https://doi.org/10.1063/1.555985 . [all data]