1,1,1-Trimethoxy-2-methylbutane

Reaction thermochemistry data

Data compiled by: Hussein Y. Afeefy, Joel F. Liebman, and Stephen E. Stein

Individual Reactions

Water + 1,1,1-Trimethoxy-2-methylbutane = 2Methyl Alcohol + Butanoic acid, 2-methyl-, methyl ester

By formula: H2O + C8H18O3 = 2CH4O + C6H12O2

Quantity Value Units Method Reference Comment
Δr-34.30 ± 0.054kJ/molCmWiberg, 1980liquid phase; solvent: Water; Hydrolysis

References

Wiberg, 1980
Wiberg, K.B., Energies of organic compounds, Rept. DOE-E(11-1)4060 Prepared for US Dept. of Energy by Yale Univ., New Haven, CT. Avail. NTIS, 1980, 1-24. [all data]