Cyclohexanamine, N,N-dimethyl-

Condensed phase thermochemistry data

Data compiled by: Hussein Y. Afeefy, Joel F. Liebman, and Stephen E. Stein

Quantity Value Units Method Reference Comment
Δfliquid-32.22 ± 0.48kcal/molCcrGutner, Masalitinova, et al., 1982
Quantity Value Units Method Reference Comment
Δcliquid-1300.9 ± 0.48kcal/molCcrGutner, Masalitinova, et al., 1982

Phase change data

Data compiled by: Robert L. Brown and Stephen E. Stein

Quantity Value Units Method Reference Comment
Tboil431.7KN/AAldrich Chemical Company Inc., 1990

Gas phase ion energetics data

Data evaluated as indicated in comments:
HL - Edward P. Hunter and Sharon G. Lias

Data compiled as indicated in comments:
LLK - Sharon G. Lias, Rhoda D. Levin, and Sherif A. Kafafi

Quantity Value Units Method Reference Comment
Proton affinity (review)235.1kcal/molN/AHunter and Lias, 1998HL
Quantity Value Units Method Reference Comment
Gas basicity227.7kcal/molN/AHunter and Lias, 1998HL

Ionization energy determinations

IE (eV) Method Reference Comment
7.5PEBrown, 1976LLK
8.09PEBrown, 1976Vertical value; LLK

Kovats' RI, non-polar column, isothermal

View large format table.

Column type Active phase Temperature (C) I Reference Comment
PackedApiezon100.995.Golovnya, Zhuravleva, et al., 1976Column length: 2.7 m

Normal alkane RI, non-polar column, temperature ramp

View large format table.

Column type Active phase I Reference Comment
CapillaryHP-5994.Jung, Wichmann, et al., 199925. m/0.20 mm/0.33 μm, 50. C @ 3. min, 5. K/min; Tend: 180. C

References

Gutner, Masalitinova, et al., 1982
Gutner, N.M.; Masalitinova, T.N.; Mon'yakova, O.N.; Lebedeva, N.D., Heats of combustion and formation of some cyclic compounds, Termodin. Organ. Soedin., 1982, 46-49. [all data]

Aldrich Chemical Company Inc., 1990
Aldrich Chemical Company Inc., Catalog Handbook of Fine Chemicals, Aldrich Chemical Company, Inc., Milwaukee WI, 1990, 1. [all data]

Hunter and Lias, 1998
Hunter, E.P.; Lias, S.G., Evaluated Gas Phase Basicities and Proton Affinities of Molecules: An Update, J. Phys. Chem. Ref. Data, 1998, 27, 3, 413-656, https://doi.org/10.1063/1.556018 . [all data]

Brown, 1976
Brown, R.S., Influence of remote substituents on ionization potential. Part II. Enamines, Can. J. Chem., 1976, 54, 1521. [all data]

Golovnya, Zhuravleva, et al., 1976
Golovnya, R.V.; Zhuravleva, I.L.; Kapustin, Yu.P., Gas chromatographic separation of tertiary isoaliphatic amines on supports treated with trisodium phosphate, Zh. Anal. Khim., 1976, 31, 764-768. [all data]

Jung, Wichmann, et al., 1999
Jung, A.; Wichmann, K.-H.; Kolb, M., VOC emission of polymeric packaging materials, LaborPraxis, 1999, 23, 9, 20-22. [all data]