OMgO

Vibrational and/or electronic energy levels

Data compiled by: Marilyn E. Jacox

State:   X

Vib.
sym.
 No.   Approximate
 type of mode
 cm-1   Med.   Method   References

Σu+ 3 Asym. stretch 767.7 Ar IR Andrews and Yustein, 1993
a1 2 MgO2 s-stretch 621.1 T Ar IR Andrews and Yustein, 1993

Additional references: Jacox, 1998, page 174

References

Andrews and Yustein, 1993
Andrews, L.; Yustein, J.T., Reaction of pulsed laser evaporated magnesium atoms with oxygen. Infrared spectra of linear OMgO and MgOMgO in solid argon, J. Phys. Chem., 1993, 97, 49, 12700, https://doi.org/10.1021/j100151a012 . [all data]

Jacox, 1998
Jacox, M.E., Vibrational and electronic energy levels of polyatomic transient molecules: supplement A, J. Phys. Chem. Ref. Data, 1998, 27, 2, 115-393, https://doi.org/10.1063/1.556017 . [all data]