HFeC2H3

Vibrational and/or electronic energy levels

Data compiled by: Marilyn E. Jacox

State:   X

Vib.
sym.
 No.   Approximate
 type of mode
 cm-1   Med.   Method   References

CH2 a-stretch 2999.5 Ar IR Kafafi, Hauge, et al., 1985
CH stretch 2923.1 Ar IR Kafafi, Hauge, et al., 1985
CH stretch 2913.0 Kr IR Kafafi, Hauge, et al., 1985
CH2 s-stretch 2901.6 Ar IR Kafafi, Hauge, et al., 1985
FeH stretch 1696.6 Ar IR Kafafi, Hauge, et al., 1985
FeH stretch 1683.8 Kr IR Kafafi, Hauge, et al., 1985
C=C stretch 1556.3 Ar IR Kafafi, Hauge, et al., 1985
C=C stretch 1563.0 Kr IR Kafafi, Hauge, et al., 1985
CH2 scissors 1399.1 Ar IR Kafafi, Hauge, et al., 1985
CH2 scissors 1408.3 Kr IR Kafafi, Hauge, et al., 1985
CH2 rock 1019.0 Ar IR Kafafi, Hauge, et al., 1985
CH2 rock 1020.9 Kr IR Kafafi, Hauge, et al., 1985
HCFe bend 972.9 Ar IR Kafafi, Hauge, et al., 1985
HCFe bend 980.2 Kr IR Kafafi, Hauge, et al., 1985
CH2 wag 944.2 Ar IR Kafafi, Hauge, et al., 1985
CH2 wag 944.7 Kr IR Kafafi, Hauge, et al., 1985
CFe stretch 507.2 Ar IR Kafafi, Hauge, et al., 1985

Additional references: Jacox, 1994, page 360

References

Kafafi, Hauge, et al., 1985
Kafafi, Z.H.; Hauge, R.H.; Margrave, J.L., Photochemistry of iron atoms and dimers with ethylene in cryogenic matrixes. The FT-IR spectrum of ethenyliron hydride, J. Am. Chem. Soc., 1985, 107, 25, 7550, https://doi.org/10.1021/ja00311a054 . [all data]

Jacox, 1994
Jacox, M.E., Vibrational and electronic energy levels of polyatomic transient molecules, American Chemical Society, Washington, DC, 1994, 464. [all data]