2-Methylacetoacetic acid, di(trimethylsilyl) deriv.

Van Den Dool and Kratz RI, non-polar column, temperature ramp

View large format table.

Column type Active phase I Reference Comment
PackedOV-11320.Tanaka, Hine, et al., 1980N2, 100-120 mesh, 70. C @ 0.5 min, 28. K/min; Column length: 1.8 m; Tend: 290. C

Van Den Dool and Kratz RI, non-polar column, custom temperature program

View large format table.

Column type Active phase I Reference Comment
PackedOV-1011320.Tanaka and Hine, 1982Program: not specified

References

Tanaka, Hine, et al., 1980
Tanaka, K.; Hine, D.G.; West-Dull, A.; Lynn, T.B., Gas-chromatographic method of analysis for urinary organic acids. I. Retention indices of 155 metabolically important compounds, Clin. Chem., 1980, 26, 13, 1839-1846. [all data]

Tanaka and Hine, 1982
Tanaka, K.; Hine, D.G., Compilation of Gas Chromatographic Retention Indices of 163 Metabolically Important Organic Acids, and Their Use in Detection of Patients with Organic Acidurias, J. Chromatogr., 1982, 239, 301-322, https://doi.org/10.1016/S0021-9673(00)81990-1 . [all data]