3-Methoxy-1-methyl-1,3-cyclohexadiene

Reaction thermochemistry data

Data compiled by: Hussein Y. Afeefy, Joel F. Liebman, and Stephen E. Stein

Individual Reactions

3-Methoxy-1-methyl-1,3-cyclohexadiene = 2,5-dihydro-3-methylanisole

By formula: C8H12O = C8H12O

Quantity Value Units Method Reference Comment
Δr-1.0 ± 3.0kJ/molEqkTaskinen and Nummelin, 1986liquid phase; solvent: Cyclohexane; GLC

3-Methoxy-1-methyl-1,3-cyclohexadiene = 1,3-Cyclohexadiene, 1-methoxy-3-methyl

By formula: C8H12O = C8H12O

Quantity Value Units Method Reference Comment
Δr-4.9 ± 1.9kJ/molEqkTaskinen and Nummelin, 1986liquid phase; solvent: Cyclohexane

References

Taskinen and Nummelin, 1986
Taskinen, E.; Nummelin, K., Thermodynamics of vinyl ethers. 31. Isomer equilibria in some six- and seven-membered cyclic dienes, J. Org. Chem., 1986, 50, 4844-4847. [all data]