1-(3-Pentoxy)-1,4-cyclohexadiene

Reaction thermochemistry data

Data compiled by: Hussein Y. Afeefy, Joel F. Liebman, and Stephen E. Stein

Individual Reactions

2-(3-Pentoxy)-1,3-cyclohexadiene = 1-(3-Pentoxy)-1,4-cyclohexadiene

By formula: C11H18O = C11H18O

Quantity Value Units Method Reference Comment
Δr-8.2 ± 1.0kJ/molEqkTaskinen and Nummelin, 1986liquid phase; solvent: Cyclohexane; GLC

1-(3-Pentoxy)-1,4-cyclohexadiene = 1,3-Cyclohexadiene, 1-(1-ethylpropoxy)-

By formula: C11H18O = C11H18O

Quantity Value Units Method Reference Comment
Δr-0.7 ± 1.5kJ/molEqkTaskinen and Nummelin, 1986liquid phase; solvent: Cyclohexane; GLC

References

Taskinen and Nummelin, 1986
Taskinen, E.; Nummelin, K., Thermodynamics of vinyl ethers. 31. Isomer equilibria in some six- and seven-membered cyclic dienes, J. Org. Chem., 1986, 50, 4844-4847. [all data]