Diazene, bis(2,3,5,6-tetrafluoro-4-(trifluoromethyl)phenyl)-1-oxide

Gas phase ion energetics data

Data compiled by: Sharon G. Lias and Joel F. Liebman

Ionization energy determinations

IE (eV) Method Reference Comment
9.75PEFurin, Petrachenko, et al., 1989Vertical value

References

Furin, Petrachenko, et al., 1989
Furin, G.G.; Petrachenko, N.E.; Vovna, V.I., Photoelectron spectra of fluorine-containing azoxybenzenes, J. Org. Chem. USSR, 1989, 26, 1725, In original 1998. [all data]