α-Terpineol

Van Den Dool and Kratz RI, non-polar column, custom temperature program

Data compiled by: NIST Mass Spectrometry Data Center, William E. Wallace, director

Column type CapillaryCapillaryCapillaryCapillaryCapillary
Active phase SE-52BPX-5HP-5MSVF-5MSBPX-5
Column length (m) 30.30.30.30.30.
Carrier gas HeHeHeHe
Substrate
Column diameter (mm) 0.320.250.250.250.25
Phase thickness (μm) 0.150.250.250.250.25
Program 45C => 1C/min => 100C => 5C/min => 250C(10min)35C => 4C/min => 200C => 30C/min => 300C (3min)50C(4min) => 10C/min => 200C(0.5min) => 20C/min => 260C(5min)40C(2min) => 5C/min => 200C (2min) => 30C/min => 260C35C(5min) => 3C/min => 210C => 40C/min => 240C (4min)
I 1188.1210.1180.1193.1213.
ReferenceBruni, Bianchi, et al., 2007Dharmawan, Kasapis, et al., 2007Pérez, Navarro, et al., 2007Carasek and Pawliszyn, 2006Cardeal, da Silva, et al., 2006
Comment MSDC-RI MSDC-RI MSDC-RI MSDC-RI MSDC-RI
Column type CapillaryCapillaryCapillaryCapillaryCapillary
Active phase SE-52DB-5SE-52DB-5DB-1
Column length (m) 30. 30.30.30.
Carrier gas He He He
Substrate
Column diameter (mm) 0.32 0.320.250.25
Phase thickness (μm) 0.15 0.150.250.25
Program 45C => 1C/min => 100C => 5C/min => 250C (10min)not specified45C => 1C/min => 100C => 5C/min => 250C(10min)40C(2min) => 4C/min => 220C => 20C/min => 280C35C => 2C/min => 200C => 5C/min => 240C
I 1183.1195.1189.1190.1160.
ReferenceGuerrini, Sacchetti, et al., 2006Özel, Gögüs, et al., 2006Sacchetti, Guerrini, et al., 2006Sampaio and Nogueira, 2006Suliman F.E.O., Fatope M.O., et al., 2006
Comment MSDC-RI MSDC-RI MSDC-RI MSDC-RI MSDC-RI
Column type CapillaryCapillaryCapillaryCapillaryCapillary
Active phase HP-5MSSE-52HP-5CBP-55 % Phenyl methyl siloxane
Column length (m) 30.30.30.30.30.
Carrier gas HeHeHeHeHe
Substrate   Chromosorb W
Column diameter (mm) 0.250.320.320.250.32
Phase thickness (μm) 0.250.150.250.250.15
Program 50C (3min) => 3C/min => 200C => 6C/min => 240C45C => 1C/min => 100C => 5C/min => 250C(10min)80 0C 8 K/min -> 150 0C 5 K/min -> 230 0C (10 min)60C => 3C/min => 240C => 10C/min => 280C(10min)45C => 1C/min => 100C => 5C/min => 250C (10min)
I 1189.1189.1166.1188.1189.
ReferenceAkpulat, Tepe, et al., 2005Bruni, Pellati, et al., 2005Gopanraj, Dan, et al., 2005Oliveira, Campos, et al., 2005Sacchetti, Maietti, et al., 2005
Comment MSDC-RI MSDC-RI MSDC-RI MSDC-RI MSDC-RI
Column type CapillaryCapillaryCapillaryCapillaryCapillary
Active phase DB-5MSZB-5SPB-1SE-52DB-5
Column length (m) 30.30.50.25.30.
Carrier gas HeHelium H2He
Substrate
Column diameter (mm) 0.250.320.250.320.32
Phase thickness (μm) 0.250.500.250.431.
Program 40 (5min) => 4C/min => 140C => 4C/min => 200C (20min)not specified70C(3min) => 4C/min => 120C => 8C/min => 250C60C(8min) => 3C/min => 180C => 20C/min => 250C(10min)40C (2min) => 5C/min => 100C => 4C/min => 230C (10min)
I 1190.1207.1177.1188.1189.
ReferenceZheng, Kim, et al., 2005Bell, 2004Díaz-Maroto, Sánchez Palomo, et al., 2004Frizzo, Lorenzo, et al., 2004Klesk, Qian, et al., 2004
Comment MSDC-RI MSDC-RI MSDC-RI MSDC-RI MSDC-RI
Column type CapillaryCapillaryCapillaryCapillaryCapillary
Active phase SE-52SE-52DB-5MSSE-52CP Sil 8 CB
Column length (m) 25.30.30.25.50.
Carrier gas  HeHeHeHe
Substrate
Column diameter (mm) 0.320.520.250.250.32
Phase thickness (μm) 0.40.150.250.25
Program 60C(8min) => 3C/min => 180C => 20C/min => 250C(10min)45C => 1C/min => 100C => 5C/min => 250C (10min)40C(5min) => 4C/min => 160C => 8C/min => 240C (15min)60C(8min) => 3C/min => 180C => 20C/min => 230C60C (2min) => 5C/min => 160C (1min) => 10C/min => 250C (2min)
I 1190.1190.1195.1186.1189.
ReferenceLorenzo, Paz, et al., 2004Sacchetti, Medici, et al., 2004Kim, Lee, et al., 2003Lorenzo, Loayza, et al., 2003Mockute and Judzentiene, 2003
Comment MSDC-RI MSDC-RI MSDC-RI MSDC-RI MSDC-RI
Column type CapillaryCapillaryCapillaryCapillaryCapillary
Active phase DB-5CBP-5HP-5SE-52BP-1
Column length (m) 30.50.50.30.50.
Carrier gas HeHeHeH2
Substrate
Column diameter (mm) 0.250.250.20.320.22
Phase thickness (μm) 0.250.250.330.420.25
Program 60C(2min) => 3C/min => 240C => 10C/min => 270C (4.5min)60C(2min) => 3C/min => 240C => 10C/min => 280C(10min)50C(2min) => 5C/min => 150C => 10C/min => 250C(30min)60C(8min) => 3C/min => 180C => 20C/min => 250C(10min)not specified
I 1184.1186.1188.1189.1173.
ReferencePassos X.S., Castro A.C.M., et al., 2003Azevedo, Campos, et al., 2002García, Alvarez, et al., 2002Lorenzo, Paz, et al., 2002Cavalli, Ranarivelo, et al., 2001
Comment MSDC-RI MSDC-RI MSDC-RI MSDC-RI MSDC-RI
Column type CapillaryCapillaryCapillaryCapillaryCapillary
Active phase SE-52SE-52DB-5MSDB-5MSDB-1
Column length (m) 25.25.30.30.60.
Carrier gas H2HeHeH2/N2He
Substrate
Column diameter (mm) 0.320.250.250.250.25
Phase thickness (μm) 0.400.250.250.250.25
Program 60 0C (8 min) 3 K/min -> 180 0C 20 K/min -> 250 0C (10 min)60 0C (8 min) 3 K/min -> 180 0C 20 K/min -> 230 0C60 0C (3 min) 2 K/min -> 220 0C 5 K/min -> 250 0C (15 min)40C (5min) => 2C/min => 200C => 5C/min => 250C (15min)-20C (5min) => 10C/min => 100C => 4C/min => 200C => 10C/min => 280C
I 1186.1191.1180.1188.1182.
ReferenceLorenzo, Dellacassa, et al., 2001Lorenzo, Saavedra, et al., 2001Boulanger and Crouzet, 2000Boulanger and Crouzet, 2000, 2Eri, Khoo, et al., 2000
Comment MSDC-RI MSDC-RI MSDC-RI MSDC-RI MSDC-RI
Column type CapillaryCapillaryCapillaryCapillaryCapillary
Active phase BP-1SE-52DB-5DB-5DB-5
Column length (m)  25.30.30.30.
Carrier gas  HeH2H2H2
Substrate
Column diameter (mm)  0.250.250.250.25
Phase thickness (μm)  0.250.250.250.25
Program not specified60C(8min) => 3C/min => 180C => 20C/min => 230C40C(5min) => 2C/min => 220C => 5C/min => 250C(15min)40C(5min) => 2C/min => 220C => 5C/min => 250C(15min)40C(5min) => 2C/min => 220C => 5C/min => 250C(15min)
I 1174.1189.1189.1192.1189.
ReferenceFilippini, Tomi, et al., 2000Lorenzo, Dellacassa, et al., 2000Boulanger, Chassagne, et al., 1999Boulanger, Chassagne, et al., 1999Boulanger, Chassagne, et al., 1999
Comment MSDC-RI MSDC-RI MSDC-RI MSDC-RI MSDC-RI
Column type CapillaryCapillaryCapillaryCapillaryCapillary
Active phase DB-5SE-52SE-54SE-54CP Sil 5 CB
Column length (m) 30.25.30.30.
Carrier gas H2HeHeHe
Substrate
Column diameter (mm) 0.250.250.320.32
Phase thickness (μm) 0.250.250.250.25
Program 40C(5min) => 2C/min => 220C => 5C/min => 250C(15min)60 0C (8 min) 3 K/min -> 180 0C 20 K/min -> 230 0C35C (2min) => 40C/min => 60C (2min) => 6C/min => 180C => 10C/min => 230C (5min)35 0C 40 0C/min -> 60 0C (2 min) 6 0C/min -> 180 0C 10 0C/min -> 230 0Cnot specified
I 1189.1190.1195.1195.1185.
ReferenceBoulanger, Chassagne, et al., 1999Loayza, de Groot, et al., 1999Tairu, Hofmann, et al., 1999Tairu, Hofmann, et al., 1999, 2Chanegriha, Baaliouamer, et al., 1998
Comment MSDC-RI MSDC-RI MSDC-RI MSDC-RI MSDC-RI
Column type CapillaryCapillaryCapillaryCapillaryCapillary
Active phase OV-1015 % Phenyl methyl siloxaneSE-52DB-5SE-54
Column length (m) 15.25.60.30.
Carrier gas HeHeHeHe
Substrate
Column diameter (mm) 0.250.310.320.25
Phase thickness (μm) 0.250.520.401.
Program 50C(2min) => (20C/min) => 120C => (7C/min) => 310C(10min)50C(2min) => (20C/min) => 120C => (7C/min) => 310C(10min)45 C (6 min) 3 C/min -> 111 0C 2 C/min -> 160 C 3 C/min -> 300 C (15 min)35C (2min) => 40C/min => 50C (1min) => 6C/min => 250C (10min)35C (2min) => 40C/min => 50C (1min) => 6C/min => 250C (10min)
I 1171.1197.1192.1197.1195.
ReferenceYasuhara, Shiraishi, et al., 1997Yasuhara, Shiraishi, et al., 1997Mondello, Dugo, et al., 1995Triqui and Reineccius, 1995Triqui and Reineccius, 1995
Comment MSDC-RI MSDC-RI MSDC-RI MSDC-RI MSDC-RI
Column type Capillary
Active phase HP-1
Column length (m) 50.
Carrier gas He
Substrate
Column diameter (mm) 0.32
Phase thickness (μm) 1.05
Program 20C(0.5min) => 60C => 4C/min => 250C
I 1187.
ReferenceSing, Smadja, et al., 1992
Comment MSDC-RI

Kovats' RI, polar column, temperature ramp

Data compiled by: NIST Mass Spectrometry Data Center, William E. Wallace, director

Column type CapillaryCapillaryCapillaryCapillaryCapillary
Active phase StabilwaxDB-WaxDB-WaxSupelcowaxInnowax
Column length (m) 30.30.30.30.30.
Carrier gas N2H2He He
Substrate
Column diameter (mm) 0.320.250.320.250.25
Phase thickness (μm) 1.0.250.250.250.25
Tstart (C) 50.40.40.60.50.
Tend (C) 220.260.220.240.250.
Heat rate (K/min) 2.4.3.3.0.5
Initial hold (min) 3.2.5.5.5.
Final hold (min) 15.15. 10.10.
I 1723.1680.1692.1661.1662.
ReferenceHazzit, Baaliouamer, et al., 2006Avato, Raffo, et al., 2004Lopes, Strobl, et al., 2004Riu-Aumatell, Castellari, et al., 2004Viña and Murillo, 2003
Comment MSDC-RI MSDC-RI MSDC-RI MSDC-RI MSDC-RI
Column type CapillaryCapillaryCapillaryCapillaryCapillary
Active phase InnowaxSupelcowax-10Carbowax 20MCarbowax 20MCarbowax 20M
Column length (m) 50.30.50.50.25.
Carrier gas HeHe  N2
Substrate
Column diameter (mm) 0.250.320.320.320.25
Phase thickness (μm) 0.250.250.20.2
Tstart (C) 50.75.60.60.60.
Tend (C) 180.230.260.260.200.
Heat rate (K/min) 2.53.2.2.5.
Initial hold (min) 5.
Final hold (min)
I 1661.1683.1661.1702.1674.
ReferenceYáñez, Pinzón, et al., 2002Tzakou and Couladis, 2001Vera and Chane-Ming, 1999Vera and Chane-Ming, 1999Kulkarni, Mallavarapu, et al., 1998
Comment MSDC-RI MSDC-RI MSDC-RI MSDC-RI MSDC-RI
Column type CapillaryCapillaryCapillaryCapillaryCapillary
Active phase Carbowax 20MDB-WaxSupelcowax-10DB-WaxDB-Wax
Column length (m) 25.60.60.60.60.
Carrier gas N2HeHeHeHe
Substrate
Column diameter (mm) 0.50.250.250.250.25
Phase thickness (μm)    0.250.25
Tstart (C) 60.40.35.40.40.
Tend (C) 200.200.200.200.200.
Heat rate (K/min) 5.2.3.3.3.
Initial hold (min)  2.5.5.5.
Final hold (min)   20.
I 1708.1697.1718.1695.1698.
ReferenceMallavarapu, Rao, et al., 1998Umano, Hagi, et al., 1994Wong and Tie, 1993Tatsuka, Suekane, et al., 1990Tatsuka, Suekane, et al., 1990
Comment MSDC-RI MSDC-RI MSDC-RI MSDC-RI MSDC-RI
Column type CapillaryCapillaryCapillaryCapillaryCapillary
Active phase Carbowax 20MDB-WaxBP-20Carbowax 20MCarbowax 20M
Column length (m) 50.60.25.50.59.
Carrier gas    H2
Substrate
Column diameter (mm) 0.220.250.3320.30.25
Phase thickness (μm)    0.15
Tstart (C) 80.40.70.70.70.
Tend (C) 200.220.200.210.190.
Heat rate (K/min) 2.2.4.2.1.
Initial hold (min)  10.2.
Final hold (min)
I 1679.1700.1685.1672.1692.
ReferenceNishimura, Yamaguchi, et al., 1989Umano and Shibamoto, 1988Wyllie, Cook, et al., 1987Gaydou, Randriamiharisoa, et al., 1986Palma-Fleming and Kepner, 1983
Comment MSDC-RI MSDC-RI MSDC-RI MSDC-RI MSDC-RI
Column type CapillaryCapillaryCapillaryCapillaryCapillary
Active phase Carbowax 20MCarbowax 20MCarbowax 20MCarbowax 20MCarbowax 20M
Column length (m) 70.70.30.30.50.
Carrier gas N2N2N2N2He
Substrate
Column diameter (mm) 0.280.280.260.260.28
Phase thickness (μm)
Tstart (C) 80.80.70.70.70.
Tend (C) 200.200.170.170.190.
Heat rate (K/min) 2.2.3.3.2.
Initial hold (min)
Final hold (min)
I 1655.1656.1681.1687.1677.
ReferenceYamaguchi and Shibamoto, 1981Yamaguchi and Shibamoto, 1981Spencer, Pangborn, et al., 1978Spencer, Pangborn, et al., 1978Tressl, Friese, et al., 1978
Comment MSDC-RI MSDC-RI MSDC-RI MSDC-RI MSDC-RI
Column type Capillary
Active phase Carbowax 20M
Column length (m) 50.
Carrier gas He
Substrate
Column diameter (mm) 0.28
Phase thickness (μm)
Tstart (C) 70.
Tend (C) 190.
Heat rate (K/min) 2.
Initial hold (min)
Final hold (min)
I 1672.
ReferenceTressl, Friese, et al., 1978, 2
Comment MSDC-RI

Van Den Dool and Kratz RI, non-polar column, temperature ramp

Data compiled by: NIST Mass Spectrometry Data Center, William E. Wallace, director

Column type CapillaryCapillaryCapillaryCapillaryCapillary
Active phase RTX-1DB-5MSDB-5Equity-5MSHP-5MS
Column length (m) 60.30.30.30.30.
Carrier gas HeHeHeHeHe
Substrate
Column diameter (mm) 0.220.250.250.250.25
Phase thickness (μm) 0.250.250.250.250.25
Tstart (C) 60.40.60.50.60.
Tend (C) 230.200.240.250.250.
Heat rate (K/min) 2.4.3.3.2.
Initial hold (min)  1.  8.
Final hold (min) 30.10. 10.30.
I 1172.1207.1191.1195.1190.
ReferenceBendahou, Muselli, et al., 2008Cho, Namgung, et al., 2008Baccouri, Ben Temime, et al., 2007Belsito E.L., Carbone C., et al., 2007Benkaci-Ali, Baaliouamer, et al., 2007
Comment MSDC-RI MSDC-RI MSDC-RI MSDC-RI MSDC-RI
Column type CapillaryCapillaryCapillaryCapillaryCapillary
Active phase HP-5BP-1BP-1DB-5MSCP-Sil PONA GB
Column length (m) 30.50.50.30.100.
Carrier gas HeHeHeHeHe
Substrate
Column diameter (mm) 0.250.220.220.250.25
Phase thickness (μm) 0.250.250.250.250.25
Tstart (C) 40.60.60.40.140.
Tend (C) 250.220.220.200.230.
Heat rate (K/min) 5.2.2.4.5.
Initial hold (min) 1.  1.10.
Final hold (min) 10.20.20.10.25.
I 1191.1172.1173.1198.1185.
ReferenceBenzo, Gilardoni, et al., 2007Boti, Koukoua, et al., 2007Castilho, Liu, et al., 2007Cho I.H., Lee S.M., et al., 2007Cunicao, Lopes, et al., 2007
Comment MSDC-RI MSDC-RI MSDC-RI MSDC-RI MSDC-RI
Column type CapillaryCapillaryCapillaryCapillaryCapillary
Active phase HP-5BP-1DB-5HP-5HP-5
Column length (m) 25.50.30.30.30.
Carrier gas HeHeHeN2N2
Substrate
Column diameter (mm) 0.250.220.250.250.25
Phase thickness (μm) 0.250.250.250.250.25
Tstart (C) 60.60.60.50.60.
Tend (C) 240.220.240.220.220.
Heat rate (K/min) 4.2.3.5.5.
Initial hold (min) 2.  10.10.
Final hold (min)  20.
I 1187.1172.1190.1192.1190.
ReferenceDehghan, Solaimanian, et al., 2007Duquesnoy, Castola, et al., 2007Flamini, Cioni, et al., 2007Flamini, Tebano, et al., 2007Flamini, Tebano, et al., 2007, 2
Comment MSDC-RI MSDC-RI MSDC-RI MSDC-RI MSDC-RI
Column type CapillaryCapillaryCapillaryCapillaryCapillary
Active phase DB-5HP-5MSBP-1DB-5DB-5
Column length (m) 30.30.50.30.30.
Carrier gas HeHeHeHeHe
Substrate
Column diameter (mm) 0.250.250.220.250.25
Phase thickness (μm) 0.250.250.250.250.25
Tstart (C) 60.60.60.60.60.
Tend (C) 246.280.220.240.240.
Heat rate (K/min) 3.3.2.3.3.
Initial hold (min)
Final hold (min)   20.
I 1192.1179.1172.1191.1191.
ReferenceHongratanaworakit and Buchbauer, 2007Kundakovic, Fokialakis, et al., 2007Lesueur, de Rocca Serra, et al., 2007Maccioni, Baldini, et al., 2007Maccioni, Baldini, et al., 2007
Comment MSDC-RI MSDC-RI MSDC-RI MSDC-RI MSDC-RI
Column type CapillaryCapillaryCapillaryCapillaryCapillary
Active phase RTX-1RTX-1HP-101HP-101HP-101
Column length (m) 60.60.25.25.25.
Carrier gas HeHeHeliumHeHe
Substrate
Column diameter (mm) 0.220.220.200.20.2
Phase thickness (μm) 0.250.250.200.20.2
Tstart (C) 60.60.70.70.70.
Tend (C) 230.230.200.200.200.
Heat rate (K/min) 2.2.3.3.3.
Initial hold (min)   2.2.2.
Final hold (min) 35.35.15.15.15.
I 1172.1172.1190.1172.1176.
ReferencePaolini J., Costa J., et al., 2007Paolini, Muselli, et al., 2007Politeo, Jukic, et al., 2007Politeo, Jukic, et al., 2007, 2Politeo, Jukic, et al., 2007, 2
Comment MSDC-RI MSDC-RI MSDC-RI MSDC-RI MSDC-RI
Column type CapillaryCapillaryCapillaryCapillaryCapillary
Active phase HP-5Equity-5DB-5HP-5MSHP-5MS
Column length (m) 30.60.30.30.30.
Carrier gas HeHeHeHeHe
Substrate
Column diameter (mm) 0.250.250.250.250.25
Phase thickness (μm) 0.251.0.250.250.25
Tstart (C) 50.40.60.60.60.
Tend (C) 250.260.260.280.280.
Heat rate (K/min) 4.5.5.4.4.
Initial hold (min) 4.1. 5.5.
Final hold (min) 10.15.
I 1189.1224.1196.1181.1187.
ReferenceQuijano, Salamanca, et al., 2007Rocha, Coelho, et al., 2007Sabulal, Dan, et al., 2007Saroglou, Arfan, et al., 2007Saroglou, Marin, et al., 2007
Comment MSDC-RI MSDC-RI MSDC-RI MSDC-RI MSDC-RI
Column type CapillaryCapillaryCapillaryCapillaryCapillary
Active phase RTX-5DB-5ZB-5HP-5MSDB-5
Column length (m) 10.30.30.30.30.
Carrier gas HeHeHeHeHe
Substrate
Column diameter (mm) 0.180.220.250.250.32
Phase thickness (μm) 0.20.250.250.250.25
Tstart (C) 40.55.50.60.40.
Tend (C) 275.240.250.280.250.
Heat rate (K/min) 50.3.3.3.5.
Initial hold (min) 0.52.  2.
Final hold (min) 0.515.  5.
I 1210.1189.1189.1189.1186.
ReferenceSetkova, Risticevic, et al., 2007Silva, Barbosa, et al., 2007Simoniatto, Bonani, et al., 2007Vagionas, Ngassapa, et al., 2007Wu, Zorn, et al., 2007
Comment MSDC-RI MSDC-RI MSDC-RI MSDC-RI MSDC-RI
Column type CapillaryCapillaryCapillaryCapillaryCapillary
Active phase DB-5DB-5DB-5DB-5BP-1
Column length (m) 30.30.30.30.50.
Carrier gas He HeHe
Substrate
Column diameter (mm) 0.320.250.250.250.22
Phase thickness (μm) 0.250.250.250.250.25
Tstart (C) 40.60.60.60.60.
Tend (C) 250.220.240.240.220.
Heat rate (K/min) 5.3.3.3.2.
Initial hold (min) 2. 2.2.
Final hold (min) 5.   20.
I 1193.1189.1189.1189.1172.
ReferenceWu, Zorn, et al., 2007Bastos, Ishimoto, et al., 2006Batista-Pereira, Fernandes, et al., 2006Batista-Pereira, Fernandes, et al., 2006Blanc, Bradesi, et al., 2006
Comment MSDC-RI MSDC-RI MSDC-RI MSDC-RI MSDC-RI
Column type CapillaryCapillaryCapillaryCapillaryCapillary
Active phase BP-1RTX-1HP-5MSDB-5MS5 % Phenyl methyl siloxane
Column length (m) 50.60.30.30.25.
Carrier gas HeHeHeHeHe
Substrate
Column diameter (mm) 0.220.220.250.250.25
Phase thickness (μm) 0.250.250.250.250.25
Tstart (C) 60.60.60.40.60.
Tend (C) 220.230.280.200.280.
Heat rate (K/min) 2.2.3.4.3.
Initial hold (min)    1.
Final hold (min) 20.45. 10.20.
I 1168.1174.1187.1198.1188.
ReferenceBoti, Bighelli, et al., 2006Cavalli, Tomi, et al., 2006Chorianopoulos N., Evergets E., et al., 2006Cho, Kim, et al., 2006Djarri, Medjroubi, et al., 2006
Comment MSDC-RI MSDC-RI MSDC-RI MSDC-RI MSDC-RI
Column type CapillaryCapillaryCapillaryCapillaryCapillary
Active phase DB-5DB-5BP-1DB-5HP-5
Column length (m) 30.30.50.50.30.
Carrier gas N2N2HeN2N2
Substrate
Column diameter (mm) 0.320.250.220.20.25
Phase thickness (μm) 0.250.250.250.320.25
Tstart (C) 60.60.60.60.60.
Tend (C) 240.240.220.220.220.
Heat rate (K/min) 3.3.2.5.5.
Initial hold (min) 3.3. 3.10.
Final hold (min) 5.3.20.5.
I 1188.1191.1162.1189.1195.
ReferenceDob, Dahmane, et al., 2006Dob, Dahmane, et al., 2006, 2Duquesnoy, Dinh, et al., 2006Esmaeili, Nematollahi, et al., 2006Flamini, Tebano, et al., 2006
Comment MSDC-RI MSDC-RI MSDC-RI MSDC-RI MSDC-RI
Column type CapillaryCapillaryCapillaryCapillaryCapillary
Active phase BP-1HP-5HP-5HP-5DB-1
Column length (m) 50.30.30.30.30.
Carrier gas HeHeHeHeN2
Substrate
Column diameter (mm) 0.220.250.250.250.25
Phase thickness (μm) 0.250.250.250.250.25
Tstart (C) 60.60.60.60.50.
Tend (C) 220.260.250.260.220.
Heat rate (K/min) 2.3.3.3.4.
Initial hold (min)
Final hold (min) 20.
I 1174.1192.1189.1190.1182.
ReferenceGonny, Cavaleiro, et al., 2006Javidnia, Miri, et al., 2006Javidnia, Miri, et al., 2006, 2Javidnia K., Miri R., et al., 2006Kuiate, Bessière, et al., 2006
Comment MSDC-RI MSDC-RI MSDC-RI MSDC-RI MSDC-RI
Column type CapillaryCapillaryCapillaryCapillaryCapillary
Active phase HP-5MSHP-5HP-1RTX-1HP-5MS
Column length (m) 30.30.25.60.30.
Carrier gas HeHeHeHeHe
Substrate
Column diameter (mm) 0.250.250.20.220.25
Phase thickness (μm) 0.250.250.330.250.25
Tstart (C) 60.60.60.60.60.
Tend (C) 280.250.300.230.280.
Heat rate (K/min) 3.10.5.2.3.
Initial hold (min)  2.3.
Final hold (min)  10.30.35.
I 1186.1194.1169.1172.1170.
ReferenceKukic J., Petrovic S., et al., 2006Liu J.M., Nan P., et al., 2006Nath, Baruah, et al., 2006Paolini J., Desjobert J.M., et al., 2006Pavlovic, Kovacevic, et al., 2006
Comment MSDC-RI MSDC-RI MSDC-RI MSDC-RI MSDC-RI
Column type CapillaryCapillaryCapillaryCapillaryCapillary
Active phase DB-5SPB-1SPB-1DB-1HP-5
Column length (m) 30.30.30.30.25.
Carrier gas HeHeHeHeHe
Substrate
Column diameter (mm) 0.320.20.250.250.25
Phase thickness (μm) 0.250.20.250.250.25
Tstart (C) 60.70.50.60.60.
Tend (C) 280.220.250.240.240.
Heat rate (K/min) 3.3.5.4.4.
Initial hold (min)   3.
Final hold (min)  15.15.
I 1185.1169.1183.1197.1189.
ReferencePavlovic, Tzakou, et al., 2006Pinto, Pina-Vaz, et al., 2006Radulovic, Mananjarasoa, et al., 2006Rezazadeh, Hamedani, et al., 2006Rezazadeh, Hamedani, et al., 2006
Comment MSDC-RI MSDC-RI MSDC-RI MSDC-RI MSDC-RI
Column type CapillaryCapillaryCapillaryCapillaryCapillary
Active phase OV-1SPB-1HP-5MSDB-5DB-5
Column length (m) 25.30.30.30.30.
Carrier gas HeHeHeHeHe
Substrate
Column diameter (mm) 0.250.20.250.250.25
Phase thickness (μm) 0.250.20.250.250.25
Tstart (C) 50.70.60.50.50.
Tend (C) 220.220.280.250.250.
Heat rate (K/min) 3.3.4.5.5.
Initial hold (min) 1. 5.2.2.
Final hold (min) 5.15.
I 1190.1169.1188.1189.1189.
ReferenceRubiolo P., Matteodo M., et al., 2006Salgueiro L.R., Pinto E., et al., 2006Saroglou, Dorizas, et al., 2006Su, Ho, et al., 2006Su, Ho, et al., 2006, 2
Comment MSDC-RI MSDC-RI MSDC-RI MSDC-RI MSDC-RI
Column type CapillaryCapillaryCapillaryCapillaryCapillary
Active phase HP-5MSHP-5CP Sil 5 CBDB-1DB-5
Column length (m) 30.30.25.30.30.
Carrier gas H2HeH2N2H2
Substrate
Column diameter (mm) 0.250.250.250.250.25
Phase thickness (μm) 0.250.25 0.250.25
Tstart (C) 50.40.80.50.35.
Tend (C) 285.300.270.200.270.
Heat rate (K/min) 4.34.10.5.5.
Initial hold (min)  5.
Final hold (min)     20.
I 1183.1187.1176.1179.1189.
ReferenceVujisic L., Vuckovic I., et al., 2006Vundac, Pfeifhofer, et al., 2006Ziegenbein, Hanssen, et al., 2006Agnaniet, Makani, et al., 2005Alves, Pinto, et al., 2005
Comment MSDC-RI MSDC-RI MSDC-RI MSDC-RI MSDC-RI
Column type CapillaryCapillaryCapillaryCapillaryCapillary
Active phase BP-1SE-54HP-5DB-5RTX-1
Column length (m) 50.50.30.60.60.
Carrier gas HeH2N2N2
Substrate
Column diameter (mm) 0.220.250.250.250.22
Phase thickness (μm) 0.250.270.250.250.25
Tstart (C) 60.50.60.70.60.
Tend (C) 220.300.220.230.220.
Heat rate (K/min) 2.5.5.2.2.
Initial hold (min)   10.2.
Final hold (min) 20.  20.20.
I 1171.1189.1190.1185.1174.
ReferenceBoti J.B., Koukoua G., et al., 2005Brantner, Pfeifhofer, et al., 2005Celik, Gokturk, et al., 2005Choi, 2005Cozzani, Muselli, et al., 2005
Comment MSDC-RI MSDC-RI MSDC-RI MSDC-RI MSDC-RI
Column type CapillaryCapillaryCapillaryCapillaryCapillary
Active phase DB-1MDN-55 % Phenyl methyl siloxaneDB-1DB-1
Column length (m) 30.30.30.30.30.
Carrier gas N2HeHeHeHe
Substrate
Column diameter (mm) 0.320.250.250.250.25
Phase thickness (μm) 0.250.251.0.250.25
Tstart (C) 50.50.40.40.40.
Tend (C) 260.250.250.250.260.
Heat rate (K/min) 2.3.7.3.2.
Initial hold (min) 3. 10. 5.
Final hold (min) 5. 5.20.20.
I 1189.1192.1205.1172.1150.
ReferenceDob, Berramdane, et al., 2005Dugo, Mondello, et al., 2005Estevez, Ventanas, et al., 2005Fanciullino, Gancel, et al., 2005de Feo, Urrunaga Soria, et al., 2005
Comment MSDC-RI MSDC-RI MSDC-RI MSDC-RI MSDC-RI
Column type CapillaryCapillaryCapillaryCapillaryCapillary
Active phase BP-1HP-5DB-1CP Sil 5 CBDB-1
Column length (m) 50.30.30.50.25.
Carrier gas HeN2HeH2
Substrate
Column diameter (mm) 0.220.250.250.220.25
Phase thickness (μm) 0.250.250.250.130.25
Tstart (C) 60.60.40.40.60.
Tend (C) 220.220.250.300.180.
Heat rate (K/min) 2.5.3.4.3.
Initial hold (min)  10.  10.
Final hold (min) 20. 20.10.10.
I 1171.1191.1168.1170.1188.
ReferenceFerrari, Tomi, et al., 2005Flamini, Luigi Cioni, et al., 2005Gancel, Ollitrault, et al., 2005Idzojtic, Kajba, et al., 2005bin Jantan, Yalvema, et al., 2005
Comment MSDC-RI MSDC-RI MSDC-RI MSDC-RI MSDC-RI
Column type CapillaryCapillaryCapillaryCapillaryCapillary
Active phase DB-5HP-5HP-5RTX-1HP-5MS
Column length (m) 25.30.30.60.30.
Carrier gas N2HeHeHeHe
Substrate
Column diameter (mm) 0.250.250.250.220.25
Phase thickness (μm) 0.250.250.250.250.25
Tstart (C) 75.60.50.60.60.
Tend (C) 210.260.250.230.250.
Heat rate (K/min) 3.3.4.2.4.
Initial hold (min) 10. 5. 2.
Final hold (min) 1. 15.35.20.
I 1188.1191.1185.1172.1189.
Referencebin Jantan, Yalvema, et al., 2005, 2Javidnia, Miri, et al., 2005Mahattanatawee, Goodner, et al., 2005Paolini, Costa, et al., 2005Pino, Mesa, et al., 2005
Comment MSDC-RI MSDC-RI MSDC-RI MSDC-RI MSDC-RI
Column type CapillaryCapillaryCapillaryCapillaryCapillary
Active phase DB-5DB-5MSHP-5MSDB-1Mega 5MS
Column length (m) 30.60.60.30.30.
Carrier gas HeHeHeN2He
Substrate
Column diameter (mm) 0.250.250.20.250.25
Phase thickness (μm) 0.250.250.250.250.25
Tstart (C) 40.40.60.50.40.
Tend (C) 260.200.200.200.240.
Heat rate (K/min) 2.2.2.5.3.
Initial hold (min) 5.   2.
Final hold (min) 20.20.10.
I 1191.1198.1188.1178.1179.
ReferenceSenatore, Napolitano, et al., 2005Seo and Baek, 2005Smadja, Rondeau, et al., 2005Tchoumbougnang, Zollo, et al., 2005Verzera, Trozzi, et al., 2005
Comment MSDC-RI MSDC-RI MSDC-RI MSDC-RI MSDC-RI
Column type CapillaryCapillaryCapillaryCapillaryCapillary
Active phase DB-5HP-5MSSE-54SPB-1ZB-5
Column length (m) 30.30.30.30.30.
Carrier gas N2HeHeHeHelium
Substrate
Column diameter (mm) 0.250.250.250.250.32
Phase thickness (μm) 0.250.250.250.250.50
Tstart (C) 45.60.60.70.40.
Tend (C) 180.280.260.220.265.
Heat rate (K/min) 2.53.2.3.7.
Initial hold (min) 10. 5.
Final hold (min) 20.  15.5.
I 1191.1188.1186.1169.1192.
ReferenceZhang, Xu, et al., 2005Aligiannis, Kalpoutzakis, et al., 2004Alma, Nitz, et al., 2004Antunes, Sevinate-Pinto, et al., 2004Bell, 2004
Comment MSDC-RI MSDC-RI MSDC-RI MSDC-RI MSDC-RI
Column type CapillaryCapillaryCapillaryCapillaryCapillary
Active phase DB-5HP-5SPB-1HP-5HP-5MS
Column length (m) 60.30.30.30.30.
Carrier gas HeliumN2He He
Substrate
Column diameter (mm) 0.250.250.20.250.25
Phase thickness (μm) 0.250.250.20.250.25
Tstart (C) 40.60.70.60.60.
Tend (C) 250.220.220.220.280.
Heat rate (K/min) 7.5.3.5.3.
Initial hold (min)  10. 10.
Final hold (min)   15.
I 1201.1180.1169.1190.1187.
ReferenceBell, 2004Bertoli, Menichini, et al., 2004Cavaleiro, Salgueiro, et al., 2004Ceccarini, Macchia, et al., 2004Chorianopoulos, Kalpoutzakis, et al., 2004
Comment MSDC-RI MSDC-RI MSDC-RI MSDC-RI MSDC-RI
Column type CapillaryCapillaryCapillaryCapillaryCapillary
Active phase RTX-5HP-5DB-5DB-5HP-5
Column length (m) 30.30.30.30.30.
Carrier gas HeHeN2N2N2
Substrate
Column diameter (mm) 0.250.250.250.250.25
Phase thickness (μm) 0.250.250.250.250.25
Tstart (C) 45.60.60.60.60.
Tend (C) 300.240.240.240.220.
Heat rate (K/min) 3.3.3.3.5.
Initial hold (min) 6.   10.
Final hold (min) 10.
I 1191.1192.1191.1191.1191.
ReferenceDugo, Mondello, et al., 2004Flamini, Bader, et al., 2004Flamini, Cioni, et al., 2004Flamini, Cioni, et al., 2004Flamini, Luigi Cioni, et al., 2004
Comment MSDC-RI MSDC-RI MSDC-RI MSDC-RI MSDC-RI
Column type CapillaryCapillaryCapillaryCapillaryCapillary
Active phase BP-1HP-5HP-5HP-5DB-5
Column length (m) 50.30.30.30.30.
Carrier gas  HeHeHeHe
Substrate
Column diameter (mm) 0.220.250.250.250.25
Phase thickness (μm) 0.250.250.25 0.25
Tstart (C) 60.40.60.60.60.
Tend (C) 220.250.260.260.260.
Heat rate (K/min) 2.3.3.3.3.
Initial hold (min)
Final hold (min) 20.
I 1175.1191.1191.1191.1189.
ReferenceGonny, Bradesi, et al., 2004Isidorov, Krajewska, et al., 2004Javidnia, Miri, et al., 2004Javidnia, Miri, et al., 2004, 2Javidnia, Miri, et al., 2004, 3
Comment MSDC-RI MSDC-RI MSDC-RI MSDC-RI MSDC-RI
Column type CapillaryCapillaryCapillaryCapillaryCapillary
Active phase HP-5MSDB-5MSSPB-1SPB-1RSL-200
Column length (m) 30.30.30.30.30.
Carrier gas HeHeHeHeH2
Substrate
Column diameter (mm) 0.250.250.20.20.32
Phase thickness (μm) 0.250.250.20.20.25
Tstart (C) 60.40.70.70.40.
Tend (C) 280.280.220.220.280.
Heat rate (K/min) 4.4.3.3.6.
Initial hold (min) 5.2.  5.
Final hold (min)   15.15.5.
I 1185.1197.1169.1169.1203.
ReferenceKarioti, Hadjipavlou-Litina, et al., 2004Mardarowicz, Wianowska, et al., 2004Moldão-Martins, Beirão-da-Costa, et al., 2004Moldão-Martins, Beirão-da-Costa, et al., 2004Ngassoum, Ousmaila, et al., 2004
Comment MSDC-RI MSDC-RI MSDC-RI MSDC-RI MSDC-RI
Column type CapillaryCapillaryCapillaryCapillaryCapillary
Active phase SPB-5SPB-5SPB-5BP-1HP-5MS
Column length (m) 30.30.30.30.30.
Carrier gas HeHeHeN2He
Substrate
Column diameter (mm) 0.250.250.250.320.25
Phase thickness (μm) 0.250.250.250.250.25
Tstart (C) 60.60.60.60.50.
Tend (C) 250.250.250.220.250.
Heat rate (K/min) 4.4.4.5.3.
Initial hold (min) 2.2.2.
Final hold (min) 20.20.20.13.
I 1189.1189.1189.1173.1192.
ReferencePíno, Marbot, et al., 2004Pino, Marbot, et al., 2004Pino, Marbot, et al., 2004, 2Raina, Kumar, et al., 2004Salido, Valenzuela, et al., 2004
Comment MSDC-RI MSDC-RI MSDC-RI MSDC-RI MSDC-RI
Column type CapillaryCapillaryCapillaryCapillaryCapillary
Active phase HP-5HP-5HP-5BP-1HP-5MS
Column length (m) 25.30.50.50.30.
Carrier gas He HeHeHe
Substrate
Column diameter (mm) 0.20.250.20.220.25
Phase thickness (μm) 0.331.0.20.250.25
Tstart (C) 60.-30.40.60.60.
Tend (C) 240.250.250.220.280.
Heat rate (K/min) 3.10.3.2.3.
Initial hold (min)  1.15.
Final hold (min) 7. 40.20.
I 1188.1192.1189.1172.1172.
ReferenceSartoratto, Machado, et al., 2004Siegmund, Derler, et al., 2004Stashenko, Jaramillo, et al., 2004Tam, Thuam, et al., 2004Tzakou, Vagias, et al., 2004
Comment MSDC-RI MSDC-RI MSDC-RI MSDC-RI MSDC-RI
Column type CapillaryCapillaryCapillaryCapillaryCapillary
Active phase HP-5MSSBP-5DB-5MSDB-5MSDB-5MS
Column length (m) 30.60.30.30.30.
Carrier gas HeHeliumHeHeHe
Substrate
Column diameter (mm) 0.250.250.250.250.25
Phase thickness (μm) 0.250.250.250.250.25
Tstart (C) 50.50.40.40.40.
Tend (C) 200.240.200.200.200.
Heat rate (K/min) 6.5.4.4.4.
Initial hold (min) 1.53.5.5.5.
Final hold (min) 5.10.20.20.20.
I 1198.1213.1201.1197.1197.
ReferenceWeissbecker, Holighaus, et al., 2004Yoo, Kim, et al., 2004Yu, Kim, et al., 2004Yu, Kim, et al., 2004, 2Zheng, Kim, et al., 2004
Comment MSDC-RI MSDC-RI MSDC-RI MSDC-RI MSDC-RI
Column type CapillaryCapillaryCapillaryCapillaryCapillary
Active phase DB-5BPX-5HP-5HP-5DB-5
Column length (m) 25.30.30.30.30.
Carrier gas N2N2N2N2He
Substrate
Column diameter (mm) 0.250.250.250.250.25
Phase thickness (μm) 0.250.250.250.250.25
Tstart (C) 75.75.60.60.60.
Tend (C) 210.210.220.220.240.
Heat rate (K/min) 3.3.5.5.3.
Initial hold (min) 10.10.10.10.
Final hold (min) 1.1.  30.
I 1188.1188.1190.1190.1190.
Referencebin Ahmad and bin Jantan, 2003bin Ahmad and bin Jantan, 2003, 2Angelini, Carpanese, et al., 2003Angelini, Carpanese, et al., 2003Bader, Caponi, et al., 2003
Comment MSDC-RI MSDC-RI MSDC-RI MSDC-RI MSDC-RI
Column type CapillaryCapillaryCapillaryCapillaryCapillary
Active phase DB-5DB-5BP-1BP-1OV-1
Column length (m) 30.30.50.50.25.
Carrier gas N2HeHeHeH2
Substrate
Column diameter (mm) 0.250.250.220.220.25
Phase thickness (μm) 0.250.250.250.250.3
Tstart (C) 60.60.60.60.50.
Tend (C) 220.240.230.230.200.
Heat rate (K/min) 5.3.2.2.3.
Initial hold (min) 10.   1.
Final hold (min)   35.35.20.
I 1190.1191.1174.1174.1168.
ReferenceBader, Caponi, et al., 2003, 2Bader, Flamini, et al., 2003Bianchini, Tomi, et al., 2003Bianchini, Tomi, et al., 2003Bicchi, Rubiolo, et al., 2003
Comment MSDC-RI MSDC-RI MSDC-RI MSDC-RI MSDC-RI
Column type CapillaryCapillaryCapillaryCapillaryCapillary
Active phase HP-5DB-1HP-5HP-5SPB-1
Column length (m) 30.30.30.30.30.
Carrier gas HeHeN2N2He
Substrate
Column diameter (mm) 0.250.250.250.250.2
Phase thickness (μm) 0.250.250.250.250.2
Tstart (C) 60.40.60.60.70.
Tend (C) 280.250.220.220.220.
Heat rate (K/min) 3.3.5.5.3.
Initial hold (min)   10.10.
Final hold (min)  20.  15.
I 1189.1174.1190.1190.1169.
ReferenceBougatsos, Meyer, et al., 2003Brat, Rega, et al., 2003Campeol, Flamini, et al., 2003Campeol, Flamini, et al., 2003Cavaleiro, Salgueiro, et al., 2003
Comment MSDC-RI MSDC-RI MSDC-RI MSDC-RI MSDC-RI
Column type CapillaryCapillaryCapillaryCapillaryCapillary
Active phase RTX-1Ultra-2SPB-1SPB-1DB-5
Column length (m) 60.25.25.25.30.
Carrier gas HeH2  N2
Substrate
Column diameter (mm) 0.220.250.250.250.25
Phase thickness (μm) 0.250.330.250.250.25
Tstart (C) 60.40.35.35.70.
Tend (C) 230.280.225.225.230.
Heat rate (K/min) 2.3.4.4.2.
Initial hold (min)  2.10.10.2.
Final hold (min) 45.10.  20.
I 1172.1180.1171.1171.1185.
ReferenceCavalli, Tomi, et al., 2003Ceva-Antunes, Bizzo, et al., 2003Chisholm, Wilson, et al., 2003Chisholm, Wilson, et al., 2003Choi, 2003
Comment MSDC-RI MSDC-RI MSDC-RI MSDC-RI MSDC-RI
Column type CapillaryCapillaryCapillaryCapillaryCapillary
Active phase DB-1DB-1DB-5DB-5HP-5
Column length (m) 30.30.30.30.30.
Carrier gas HeHeHeHeN2
Substrate
Column diameter (mm) 0.250.250.250.250.25
Phase thickness (μm) 0.250.250.250.250.25
Tstart (C) 40.40.60.60.60.
Tend (C) 250.250.240.240.220.
Heat rate (K/min) 2.2.3.3.5.
Initial hold (min) 5.5.  10.
Final hold (min) 20.
I 1161.1155.1190.1191.1193.
Referencede Feo, Bruno, et al., 2003de Feo, Urrunaga Soria, et al., 2003Flamini, Cioni, et al., 2003Flamini, Luigi Cioni, et al., 2003Flamini, Luigi Cioni, et al., 2003, 2
Comment MSDC-RI MSDC-RI MSDC-RI MSDC-RI MSDC-RI
Column type CapillaryCapillaryCapillaryCapillaryCapillary
Active phase HP-5HP-5DB-1DB-5HP-5
Column length (m) 30.30.30.30.30.
Carrier gas N2HeHe
Substrate
Column diameter (mm) 0.250.250.250.320.25
Phase thickness (μm) 0.250.250.250.5
Tstart (C) 60.60.40.40.25.
Tend (C) 220.280.250.265.150.
Heat rate (K/min) 5.3.3.7.3.
Initial hold (min) 10.   5.
Final hold (min)   20.5.
I 1195.1189.1168.1207.1187.
ReferenceFlamini, Luigi Cioni, et al., 2003, 3Fokialakis, Melliou, et al., 2003Gancel, Ollitrault, et al., 2003Högnadóttir and Rouseff, 2003Isidorov, Vinogorova, et al., 2003
Comment MSDC-RI MSDC-RI MSDC-RI MSDC-RI MSDC-RI
Column type CapillaryCapillaryCapillaryCapillaryCapillary
Active phase DB-5DB-5DB-5HP-5HP-5MS
Column length (m) 30.30.25.30.60.
Carrier gas HeN2HeHeHe
Substrate
Column diameter (mm) 0.250.250.250.250.25
Phase thickness (μm) 0.250.25 0.250.25
Tstart (C) 75.75.60.60.40.
Tend (C) 230.230.260.280.310.
Heat rate (K/min) 3.3.4.4.3.
Initial hold (min) 10.10. 5.1.
Final hold (min) 20.   20.
I 1188.1188.1192.1177.1196.
ReferenceJantan, Ling, et al., 2003bin Jantan, Yassin, et al., 2003Javidnia, Miri, et al., 2003Karioti, Skaltsa, et al., 2003Lalel, Singh, et al., 2003
Comment MSDC-RI MSDC-RI MSDC-RI MSDC-RI MSDC-RI
Column type CapillaryCapillaryCapillaryCapillaryCapillary
Active phase HP-5HP-5MSHP-5CP Sil 5 CBSPB-5
Column length (m) 30.30.30.60.30.
Carrier gas HeHeHeHeHe
Substrate
Column diameter (mm) 0.250.250.250.320.25
Phase thickness (μm) 0.250.250.250.250.25
Tstart (C) 60.60.60.60.60.
Tend (C) 240.280.280.280.250.
Heat rate (K/min) 3.3.3.3.4.
Initial hold (min)    10.2.
Final hold (min)    60.20.
I 1190.1189.1189.1170.1189.
ReferenceMacchioni, Cioni, et al., 2003Mimica-Dukic, Kujundzic, et al., 2003Ngassapa, Runyoro, et al., 2003Pino, Almora, et al., 2003Pino, Marbot, et al., 2003
Comment MSDC-RI MSDC-RI MSDC-RI MSDC-RI MSDC-RI
Column type CapillaryCapillaryCapillaryCapillaryCapillary
Active phase HP-5MSMS5RTX-5HP-5HP-5
Column length (m) 30.25.30.30.30.
Carrier gas He HeHeHe
Substrate
Column diameter (mm) 0.250.250.250.250.25
Phase thickness (μm) 0.250.250.250.250.25
Tstart (C) 50.40.45.40.60.
Tend (C) 250.180.250.240.280.
Heat rate (K/min) 3.3.3.3.4.
Initial hold (min)   6. 5.
Final hold (min)
I 1191.1193.1196.1190.1187.
ReferenceSalido, Altarejos, et al., 2003Shao, Marriott, et al., 2003Shellie, Marriott, et al., 2003Shellie and Marriott, 2003Skaltsa, Demetzos, et al., 2003
Comment MSDC-RI MSDC-RI MSDC-RI MSDC-RI MSDC-RI
Column type CapillaryCapillaryCapillaryCapillaryCapillary
Active phase DB-1HP-5HP-5Mega 5MSSPB-1
Column length (m) 30.30.30.30.30.
Carrier gas HeHeHeHeHe
Substrate
Column diameter (mm) 0.250.250.250.250.20
Phase thickness (μm) 0.250.250.250.250.20
Tstart (C) 40.60.60.40.70.
Tend (C) 325.280.280.240.220.
Heat rate (K/min) 3.3.3.3.3.
Initial hold (min)    2.
Final hold (min)     15.
I 1164.41189.1190.1179.1169.
ReferenceSun and Stremple, 2003Tsiri, Kretsi, et al., 2003Tzakou, Couladis, et al., 2003Verzera, Trozzi, et al., 2003Cavaleiro, Salgueiro, et al., 2002
Comment MSDC-RI MSDC-RI MSDC-RI MSDC-RI MSDC-RI
Column type CapillaryCapillaryCapillaryCapillaryCapillary
Active phase DB-5HP-5MSHP-5MSSE-52DB-5
Column length (m) 30.30.30.25.30.
Carrier gas HeHe N2
Substrate
Column diameter (mm) 0.250.250.250.320.25
Phase thickness (μm) 0.250.250.250.150.25
Tstart (C) 70.60.50.45.50.
Tend (C) 230.300.280.200.280.
Heat rate (K/min) 4.3.3.3.3.
Initial hold (min) 2. 5.5.5.
Final hold (min) 20.  20.
I 1185.1190.1183.1156.1174.
ReferenceChoi, Kim. M.-S.L., et al., 2002Couladis, Chinou, et al., 2002Demetzos, Angelopoulou, et al., 2002Duru, Cakir, et al., 2002Economakis, Skaltsa, et al., 2002
Comment MSDC-RI MSDC-RI MSDC-RI MSDC-RI MSDC-RI
Column type CapillaryCapillaryCapillaryCapillaryCapillary
Active phase DB-5DB-5HP-5HP-5RTX-5 MS
Column length (m) 30.30.30.30.30.
Carrier gas HeHeN2 He
Substrate
Column diameter (mm) 0.250.250.250.250.25
Phase thickness (μm) 0.250.250.250.250.25
Tstart (C) 60.60.60.60.45.
Tend (C) 240.240.220.280.180.
Heat rate (K/min) 3.3.5.3.2.5
Initial hold (min)   10.5.10.
Final hold (min)
I 1190.1191.1192.1189.1191.
ReferenceFlamini, Cioni, et al., 2002Flamini, Cioni, et al., 2002, 2Flamini, Cioni, et al., 2002, 3Fokialakis, Magiatis, et al., 2002Hudaib, Speroni, et al., 2002
Comment MSDC-RI MSDC-RI MSDC-RI MSDC-RI MSDC-RI
Column type CapillaryCapillaryCapillaryCapillaryCapillary
Active phase DB-1SE-30DB-5DB-5BP-1
Column length (m) 25.25.25.30.50.
Carrier gas N2N2HeHeHe
Substrate
Column diameter (mm) 0.250.250.250.250.22
Phase thickness (μm)  0.25 0.250.25
Tstart (C) 60.60.70.60.60.
Tend (C) 180.180.275.260.220.
Heat rate (K/min) 3.3.4.4.2.
Initial hold (min) 10.10.
Final hold (min) 10.10.  20.
I 1175.1175.1184.1189.1172.
Referencebin Jantan and bin Ahmad, 2002bin Jantan, Ayop, et al., 2002Javidnia, Miri, et al., 2002Javidnia, Miri, et al., 2002, 2Lota, de Rocca Serra, et al., 2002
Comment MSDC-RI MSDC-RI MSDC-RI MSDC-RI MSDC-RI
Column type CapillaryCapillaryCapillaryCapillaryCapillary
Active phase HP-5RTX-5HP-1CP Sil 5 CBSPB-5
Column length (m) 30.30.24.25.30.
Carrier gas HeHeHeN2He
Substrate
Column diameter (mm) 0.250.250.320.250.25
Phase thickness (μm) 0.250.250.170.250.25
Tstart (C) 60.45.60.60.60.
Tend (C) 280.300.250.280.250.
Heat rate (K/min) 3.3.4.4.4.
Initial hold (min) 5.6.2.6.2.
Final hold (min)  10.20. 20.
I 1189.1191.1169.1167.1189.
ReferenceMagiatis, Skaltsounis, et al., 2002Mondello, Zappia, et al., 2002Nath, Sarma, et al., 2002Pino, Marbot, et al., 2002Pino, Marbot, et al., 2002, 2
Comment MSDC-RI MSDC-RI MSDC-RI MSDC-RI MSDC-RI
Column type CapillaryCapillaryCapillaryCapillaryCapillary
Active phase CP Sil 5 CBCP Sil 5 CBDB-1HP-5RTX-5
Column length (m) 30.50.50.30.30.
Carrier gas H2HeHeHeHe
Substrate
Column diameter (mm) 0.250.320.220.250.25
Phase thickness (μm) 0.250.40.250.250.25
Tstart (C) 60.60.60.60.45.
Tend (C) 280.280.220.280.250.
Heat rate (K/min) 2.3.2.3.3.
Initial hold (min) 10.10.  6.
Final hold (min) 40.60.20.
I 1171.1171.1174.1169.1189.
ReferencePino, Marbot, et al., 2002, 3Pino, Marbot, et al., 2002, 4Pintore, Usai, et al., 2002Pitarokili, Couladis, et al., 2002Shellie, Mondello, et al., 2002
Comment MSDC-RI MSDC-RI MSDC-RI MSDC-RI MSDC-RI
Column type CapillaryCapillaryCapillaryCapillaryCapillary
Active phase RTX-5OV-1HP-5HP-5BP-1
Column length (m) 30.25.30.30.50.
Carrier gas HeHeHeHeHe
Substrate
Column diameter (mm) 0.250.20.250.250.22
Phase thickness (μm) 0.250.50.250.250.25
Tstart (C) 45.50.60.60.60.
Tend (C) 250.200.280.280.230.
Heat rate (K/min) 3.2.3.3.2.
Initial hold (min) 6.1.5.5.
Final hold (min)  5.  35.
I 1198.1170.251190.1189.1174.
ReferenceShellie, Mondello, et al., 2002Tarján, Bitter, et al., 2002Aligiannis, Kalpoutzakis, et al., 2001Aligiannis, Kalpoutzakis, et al., 2001, 2Bianchini, Tomi, et al., 2001
Comment MSDC-RI MSDC-RI MSDC-RI MSDC-RI MSDC-RI
Column type CapillaryCapillaryCapillaryCapillaryCapillary
Active phase CP-Sil 8CB-MSSPB-1SPB-1HP-5HP-5
Column length (m) 60.15.15.30.30.
Carrier gas    HeHe
Substrate
Column diameter (mm) 0.250.250.250.250.25
Phase thickness (μm) 0.250.250.250.250.50
Tstart (C) 40.35.35.60.60.
Tend (C) 280.225.225.380.280.
Heat rate (K/min) 4.6.6.3.3.
Initial hold (min) 2.3.3.
Final hold (min)  10.10.
I 1203.1171.1171.1190.1190.
ReferenceBruna, Hierro, et al., 2001Chisholm, Wilson, et al., 2001Chisholm, Wilson, et al., 2001Couladis, Tsortanidou, et al., 2001Couladis, Tzakou, et al., 2001
Comment MSDC-RI MSDC-RI MSDC-RI MSDC-RI MSDC-RI
Column type CapillaryCapillaryCapillaryCapillaryCapillary
Active phase HP-5MSRTX-5 MSRTX-5 MSSE-30BP-1
Column length (m) 30.30.30.25.50.
Carrier gas HeHeHeN2He
Substrate
Column diameter (mm) 0.250.250.250.200.22
Phase thickness (μm) 0.250.250.25 0.25
Tstart (C) 60.70.70.60.60.
Tend (C) 280.210.210.180.220.
Heat rate (K/min) 3.4.4.3.2.
Initial hold (min) 5.10.10.10.
Final hold (min)  10.10.1.
I 1189.1193.1193.1188.1172.
ReferenceGiamakis, Kretsi, et al., 2001Hudaib, Grazia Bellardi, et al., 2001Hudaib, Grazia Bellardi, et al., 2001bin Jantan, Basni, et al., 2001Lota, Serra, et al., 2001
Comment MSDC-RI MSDC-RI MSDC-RI MSDC-RI MSDC-RI
Column type CapillaryCapillaryCapillaryCapillaryCapillary
Active phase BP-1DB-5CP Sil 5 CBCP Sil 5 CBBP-1
Column length (m) 50.30.50.50.50.
Carrier gas HeH2HeHeHe
Substrate
Column diameter (mm) 0.220.250.320.320.22
Phase thickness (μm) 0.250.250.40.40.25
Tstart (C) 60.60.60.60.60.
Tend (C) 220.240.280.280.220.
Heat rate (K/min) 2.3.3.3.2.
Initial hold (min)   10.10.
Final hold (min)   60.60.20.
I 1172.1190.1171.1171.1173.
ReferenceLota, Serra, et al., 2001Nogueira, Bittrich, et al., 2001Pino and Marbot, 2001Pino, Marbot, et al., 2001Rezzi, Bighelli, et al., 2001
Comment MSDC-RI MSDC-RI MSDC-RI MSDC-RI MSDC-RI
Column type CapillaryCapillaryCapillaryCapillaryCapillary
Active phase BP-1HP-5MSHP-5MSBPX-5HP-5
Column length (m) 50.30.30.50.30.
Carrier gas  HeHeH2He
Substrate
Column diameter (mm) 0.220.250.250.220.20
Phase thickness (μm) 0.250.250.250.250.25
Tstart (C) 60.50.60.60.60.
Tend (C) 220.250.280.180.180.
Heat rate (K/min) 2.3.4.4.4.
Initial hold (min)   5.5.8.
Final hold (min) 20.  5.2.
I 1172.1192.1187.1217.1189.
ReferenceRezzi, Cavaleiro, et al., 2001Salido, Altarejos, et al., 2001Skaltsa, Mavrommati, et al., 2001Zabaras and Wyllie, 2001Alonzo, Bosco, et al., 2000
Comment MSDC-RI MSDC-RI MSDC-RI MSDC-RI MSDC-RI
Column type CapillaryCapillaryCapillaryCapillaryCapillary
Active phase BP-1HP-5BP-1BP-1HP-101
Column length (m) 50.30.50.50.25.
Carrier gas  HeHeHeHe
Substrate
Column diameter (mm) 0.220.250.220.220.2
Phase thickness (μm) 0.250.250.250.250.2
Tstart (C) 60.40.60.60.70.
Tend (C) 220.200.230.230.200.
Heat rate (K/min) 2.2.2.2.3.
Initial hold (min)  5.  2.
Final hold (min) 20.20.35.35.10.
I 1172.1209.1172.1172.1183.
ReferenceBaldovini, Ristorcelli, et al., 2000Kim, Thuy, et al., 2000Lota, de Rocca Serra, et al., 2000Lota, de Rocca Serra, et al., 2000Milos and Radonic, 2000
Comment MSDC-RI MSDC-RI MSDC-RI MSDC-RI MSDC-RI
Column type CapillaryCapillaryCapillaryCapillaryCapillary
Active phase RTX-5CP Sil 5 CBHP-5HP-5Mega 5MS
Column length (m) 10.50.30.30.30.
Carrier gas HeH2HeHeHe
Substrate
Column diameter (mm) 0.10.220.250.250.25
Phase thickness (μm) 0.10.130.250.250.25
Tstart (C) 50.40.50.70.40.
Tend (C) 350.300.280.230.240.
Heat rate (K/min) 12.34.4.2.3.
Initial hold (min)   5. 2.
Final hold (min)  10.
I 1196.1176.1189.1184.1179.
ReferenceMondello, Zappia, et al., 2000Pfeifhofer, 2000Skaltsa, Lazari, et al., 2000Song, Sawamura, et al., 2000Verzera, la Rosa, et al., 2000
Comment MSDC-RI MSDC-RI MSDC-RI MSDC-RI MSDC-RI
Column type CapillaryCapillaryCapillaryCapillaryCapillary
Active phase Mega 5MSCBP-1DB-5MSHP-5BP-1
Column length (m) 30.30.30.30.50.
Carrier gas HeHeH2HeHe
Substrate
Column diameter (mm) 0.250.250.250.250.22
Phase thickness (μm) 0.25 0.250.250.25
Tstart (C) 40.60.40.50.60.
Tend (C) 240.240.200.280.230.
Heat rate (K/min) 3.4.2.4.2.
Initial hold (min) 2.  5.
Final hold (min)     35.
I 1179.1186.1189.1189.1172.
ReferenceVerzera, Trozzi, et al., 2000Zunino, Lopez, et al., 2000Chassagne, Boulanger, et al., 1999Lazari, Skaltsa, et al., 1999Lota, Serra, et al., 1999
Comment MSDC-RI MSDC-RI MSDC-RI MSDC-RI MSDC-RI
Column type CapillaryCapillaryCapillaryCapillaryCapillary
Active phase BP-1OV-101DB-1DB-1HP-1
Column length (m) 50.25.60.30.60.
Carrier gas HeN2He He
Substrate
Column diameter (mm) 0.220.250.250.250.25
Phase thickness (μm) 0.25 0.250.250.25
Tstart (C) 60.50.50.50.50.
Tend (C) 230.200.220.220.250.
Heat rate (K/min) 2.5.4.3.2.5
Initial hold (min)    3.5.
Final hold (min) 35.
I 1172.1180.1178.1172.1190.
ReferenceLota, Serra, et al., 1999Menut, Bessiere, et al., 1999Mirza and Sefidkon, 1999Muselli, Hoi, et al., 1999Stashenko, Cervantes, et al., 1999
Comment MSDC-RI MSDC-RI MSDC-RI MSDC-RI MSDC-RI
Column type CapillaryCapillaryCapillaryCapillaryCapillary
Active phase Methyl SiliconeCP Sil 5 CBOV-1SPB-1DB-5
Column length (m) 50.25.25.60.30.
Carrier gas N2He N2
Substrate
Column diameter (mm) 0.250.250.250.320.25
Phase thickness (μm) 0.17 0.30.250.25
Tstart (C) 80.60.50.40.50.
Tend (C) 200.260.200.200.250.
Heat rate (K/min) 2.5.3.4.3.
Initial hold (min)   1.
Final hold (min)   20.20.
I 1186.1177.1167.1167.1189.
ReferenceSumathykutty, Rao, et al., 1999Weyerstahl, Marschall, et al., 1999Bicchi, Rubiolo, et al., 1998Chen, Huang, et al., 1998Isidorov, Zenkevich, et al., 1998
Comment MSDC-RI MSDC-RI MSDC-RI MSDC-RI MSDC-RI
Column type CapillaryCapillaryCapillaryCapillaryCapillary
Active phase BP-1Methyl SiliconeBP-1BP-1DB-1
Column length (m) 50. 50.50.10.
Carrier gas He HeHeH2
Substrate
Column diameter (mm) 0.22 0.220.220.25
Phase thickness (μm) 0.25 0.250.250.25
Tstart (C) 60.50.60.60.80.
Tend (C) 220.250.230.230.160.
Heat rate (K/min) 2.4.2.2.5.
Initial hold (min)
Final hold (min) 20. 35.35.
I 1177.1172.1174.1171.1161.
ReferenceTam, An, et al., 1998Analytical Methods Committee, 1997Mariotti, Costa, et al., 1997Mariotti, Tomi, et al., 1997Perry, van Klink, et al., 1997
Comment MSDC-RI MSDC-RI MSDC-RI MSDC-RI MSDC-RI
Column type CapillaryCapillaryCapillaryCapillaryCapillary
Active phase DB-5DB-5DB-1DB-5Methyl Silicone
Column length (m) 30.60.60.30.25.
Carrier gas H2HeHeHeHe
Substrate
Column diameter (mm) 0.250.240.250.320.2
Phase thickness (μm)   0.25 0.3
Tstart (C) 60.50.50.80.40.
Tend (C) 220.280.250.200.200.
Heat rate (K/min) 2.5.3.52.2.
Initial hold (min) 3.3.5.
Final hold (min)    30.
I 1179.1191.1187.1189.1191.
ReferenceSakho, Chassagne, et al., 1997Tzakou, Roussis, et al., 1997Stashenko, Prada, et al., 1996Vahirua-Lechat, Menut, et al., 1996Píry, Príbela, et al., 1995
Comment MSDC-RI MSDC-RI MSDC-RI MSDC-RI MSDC-RI
Column type CapillaryCapillaryCapillaryCapillaryCapillary
Active phase DB-1CP Sil 5 CBHP-101DB-5OV-101
Column length (m) 60.25.50.30.50.
Carrier gas HeHeN2HeN2
Substrate
Column diameter (mm) 0.250.220.250.250.25
Phase thickness (μm) 0.250.11
Tstart (C) 70.80.70.50.80.
Tend (C) 250.230.200.250.200.
Heat rate (K/min) 2.51.3.4.2.
Initial hold (min) 5.8.
Final hold (min) 15.16.
I 1183.1185.1197.1199.1177.
ReferenceCombariza, Tirado, et al., 1994Chanegriha and Baaliouamer, 1993Chung, Eiserich, et al., 1993Gómez, Ledbetter, et al., 1993Yang, Sugisawa, et al., 1992
Comment MSDC-RI MSDC-RI MSDC-RI MSDC-RI MSDC-RI
Column type CapillaryCapillaryCapillaryCapillaryCapillary
Active phase OV-101DB-5HP-1DB-1DB-1
Column length (m) 50.60.50.30.30.
Carrier gas N2HeHe
Substrate
Column diameter (mm) 0.250.320.320.250.25
Phase thickness (μm)  1.1.05
Tstart (C) 80.40.40.50.50.
Tend (C) 200.220.230.300.300.
Heat rate (K/min) 2.3.2.2.2.
Initial hold (min)
Final hold (min)   40.
I 1178.1193.1182.1165.01168.4
ReferenceYang, Sugisawa, et al., 1992Le Quere and Latrasse, 1990Tang, Zhang, et al., 1990Chang, Sheng, et al., 1989Chang, Sheng, et al., 1989
Comment MSDC-RI MSDC-RI MSDC-RI MSDC-RI MSDC-RI
Column type CapillaryCapillaryCapillaryCapillaryCapillary
Active phase DB-5OV-101CP Sil 5 CBOV-1OV-1
Column length (m) 0.3250.26.30.30.
Carrier gas H2H2 HeHe
Substrate
Column diameter (mm) 1.0.320.320.50.5
Phase thickness (μm)   1.250.80.8
Tstart (C) 30.50.100.40.40.
Tend (C) 180.200.250.220.220.
Heat rate (K/min) 1.52.10.2.2.
Initial hold (min) 5.
Final hold (min)
I 1185.1171.1191.1169.1174.
ReferenceGuichard and Souty, 1988Pieribattesti, Smadja, et al., 1988Halket and Schulten, 1985De Pooter, Omar, et al., 1985De Pooter, Omar, et al., 1985
Comment MSDC-RI MSDC-RI MSDC-RI MSDC-RI MSDC-RI
Column type Packed
Active phase OV-101
Column length (m) 2.
Carrier gas Ar
Substrate W-AW-DMCS
Column diameter (mm)
Phase thickness (μm)
Tstart (C) 100.
Tend (C)
Heat rate (K/min) 2.
Initial hold (min)
Final hold (min)
I 1177.
ReferenceSzabolcs, Benecke, et al., 1985
Comment MSDC-RI

Normal alkane RI, polar column, custom temperature program

Data compiled by: NIST Mass Spectrometry Data Center, William E. Wallace, director

Column type CapillaryCapillaryCapillaryCapillaryCapillary
Active phase PEG-20M InnowaxSupelco CO Wax-10Supelco CO Wax-10Supelco CO Wax-10DB-Wax
Column length (m) 30.60.60.60.30.
Carrier gas NitrogenHeliumHeliumHeliumHelium
Substrate
Column diameter (mm) 0.250.320.320.320.25
Phase thickness (μm) 0.250.250.250.250.25
Program 50 0C (7 min) 20 0C/min -> 130 0C (1 min) 1 0C/min -> 150 0C 8 0C/min -> 190 0C (5 min)35 0C (6 min) 2 0C/min -> 60 0C (5 min) 5 0C/min -> 200 0C 25 0C/min -> 250 0C (6 min)not specifiednot specifiednot specified
I 1693.1701.1705.1715.1659.
ReferenceWang, Tian, et al., 2013Prompona, Kandylis, et al., 2012Prompona, Kandylis, et al., 2012Prompona, Kandylis, et al., 2012Welke, Manfroi, et al., 2012
Comment MSDC-RI MSDC-RI MSDC-RI MSDC-RI MSDC-RI
Column type CapillaryCapillaryCapillaryCapillaryCapillary
Active phase DB-WaxInnowax FSCHP-InnowaxSOLGel-WaxSOLGel-Wax
Column length (m) 30.60.60.30.30.
Carrier gas HeliumHeliumHeliumHeliumHelium
Substrate
Column diameter (mm) 0.250.250.250.250.25
Phase thickness (μm) 0.250.250.250.250.25
Program not specified60 0C (10 min) 4 0C/min -> 220 0C (10 min) 1 0C/min -> 240 0Cnot specified40 0C (2 min) 5 0C/min -> 140 0C 10 0C/min -> 250 0C (3 min)not specified
I 1668.1706.1706.1703.1718.
ReferenceWelke, Manfroi, et al., 2012Demirci, Temel, et al., 2011Feng, Cui, et al., 2011Johanningsmeier and McFeeters, 2011Johanningsmeier and McFeeters, 2011
Comment MSDC-RI MSDC-RI MSDC-RI MSDC-RI MSDC-RI
Column type CapillaryCapillaryCapillaryCapillaryCapillary
Active phase HP InnowaxInnowaxDB-WaxFFAPHP Innowax
Column length (m) 30.60.30.25.60.
Carrier gas Nitrogen HeliumNitrogen
Substrate
Column diameter (mm) 0.250.250.250.320.25
Phase thickness (μm) 0.250.330.250.300.33
Program 35 0C (10 min) 3 0C/min -> 205 0C 10 0C/min -> 225 0Cnot specifiednot specified36 0C 20 0C/min -> 85 0C 1 0C/min -> 145 0C 3 0C/min -> 250 0Cnot specified
I 1700.1706.1712.1706.1706.
ReferenceLaribi, Kouki, et al., 2011Noorizadeh, Farmany, et al., 2011Zeng, Xie, et al., 2011Bailly and Collin, 2010Noorizadeh and Farmany, 2010
Comment MSDC-RI MSDC-RI MSDC-RI MSDC-RI MSDC-RI
Column type CapillaryCapillaryCapillaryCapillaryCapillary
Active phase Innowax FSCFFAPInnowax FSCCP-Wax 52 CBDB-Wax
Column length (m) 60.25.60.50.15.
Carrier gas HeliumNitrogenHeliumHeliumHelium
Substrate
Column diameter (mm) 0.250.320.250.250.25
Phase thickness (μm) 0.250.300.250.200.25
Program 60 0C (10 min) 4 0C/min -> 220 0C (10 min) 1 0C/min -> 240 0C36 0C 20 0C/min -> 85 0C 1 0C -> 145 0C 3 0C/min -> 230 0C60 0C (10 min) 4 0C/min -> 220 0C (10 min) 1 0C/min -> 240 0C60 0C (5 min) 3 0C/min -> 250 0C (20 min) 1 0C/min -> 255 0C50 0C (5 min) 6 0C/min -> 125 0C 10 0C/min -> 170 0C
I 1706.1706.1707.1691.1671.
ReferencePolatoglu, Demirci, et al., 2010Bailly, Jerkovic, et al., 2009Baser, Demirci, et al., 2009Genisheva and Oliveira, 2009Keefover-Ring, Thompson, et al., 2009
Comment MSDC-RI MSDC-RI MSDC-RI MSDC-RI MSDC-RI
Column type CapillaryCapillaryCapillaryCapillaryCapillary
Active phase DB-WaxDB-WaxHP InnowaxCP-Wax 52 CBHP Innowax FSP
Column length (m) 15.60.50.60.60.
Carrier gas HeliumHeliumHeliumHeliumHelium
Substrate
Column diameter (mm) 0.250.250.200.250.25
Phase thickness (μm) 0.250.500.250.250.25
Program 50 0C (5 min) 6 0C/min -> 125 0C 10 0C/min -> 170 0C40 0C (3 min) 10 0C/min -> 90 0C 2 0C/min -> 230 0C (37 min)40 0C (5 min) 2 0C/min -> 270 0C -> 260 0C (20 min)45 0C (5 min) 3 0C/min -> 150 0C 10 0C/min -> 240 0C60 0C (10 min) 4 0C/min -> 220 0C (10 min) 1 0C/min -> 240 0C (20 min)
I 1678.1705.1706.1696.1706.
ReferenceKeefover-Ring, Thompson, et al., 2009Loscos, Hernandez-Orte, et al., 2009Mancini, Arnold, et al., 2009Romeo, Verzera, et al., 2009Wedge, Klun, et al., 2009
Comment MSDC-RI MSDC-RI MSDC-RI MSDC-RI MSDC-RI
Column type CapillaryCapillaryCapillaryCapillaryCapillary
Active phase HP-20MInnowaxCP-Wax 52 CBDB-WaxHP-Innowax FSC
Column length (m) 25.30.50.30.60.
Carrier gas HeliumHeliumHeliumHeliumN2
Substrate
Column diameter (mm) 0.200.250.250.320.25
Phase thickness (μm) 0.200.250.290.250.25
Program 30 0C (1 min) 50 0C/min -> 110 0C 1.5 0C/min -> 145 0C 4 0C/min -> 220 0C (10 min)not specified33 0C (1 min) 2 0C/min -> 130 0C 10 0C/min -> 220 0C40 0C (3 min) 4 0C/min -> 160 0C 7 0C/min -> 220 0C (8 min)60C(10min) => 4C/min => 220C(10min) => 1C/min => 240C
I 1688.1694.1681.1718.1706.
ReferenceZellner, Amorim, et al., 2009Aicha, Ines, et al., 2008Kaack and Christensen, 2008Li, Tao, et al., 2008Baser K.H.C. and Demirci B., 2007
Comment MSDC-RI MSDC-RI MSDC-RI MSDC-RI MSDC-RI
Column type CapillaryCapillaryCapillaryCapillaryCapillary
Active phase Supelcowax-10HP-InnowaxCarbowax 20MInnowax FSCDB-Wax
Column length (m) 30.50.30.60.30.
Carrier gas HeHeHeNitrogenHe
Substrate
Column diameter (mm) 0.250.20.250.250.32
Phase thickness (μm) 0.250.20.250.250.25
Program 40C(10min) => 2C/min => 200C(1min) => 2C/min => 250C (10min)40C(5min) => 2C/min => 250C(15min) => 10C/min => 270Cnot specified60 0C (10 min) 1 0C/min -> 220 0C (10 min) 1 0C/min -> 240 0C40C(3min) => 4C/min => 160C => 7C/min => 230C (8min)
I 1710.1707.1705.1706.1718.
ReferenceBosch-Fuste, Riu-Aumatell, et al., 2007Formisano, Mignola, et al., 2007Hudaib and Aburjai, 2007Kaya, Benirci, et al., 2007Li, Tao, et al., 2007
Comment MSDC-RI MSDC-RI MSDC-RI MSDC-RI MSDC-RI
Column type CapillaryCapillaryCapillaryCapillaryCapillary
Active phase DB-Wax EtrHP-InnowaxDB-WaxInnowax FSCHP Innowax FSP
Column length (m) 60.30.30.60.60.
Carrier gas HeHeliumHydrogenHeN2
Substrate
Column diameter (mm) 0.250.250.320.250.25
Phase thickness (μm) 0.50.250.500.250.25
Program 40C(3min) => 10C/min => 90C => 2C/min => 230C (37min)30 0C (5 min) 5 0C/min -> 100 0C (5 min) 1 0C/min -> 130 0C 10 0C/min -> 195 0C (45 min)60 0C (3 min) 2 0C/min -> 220 0C 3 0C/min -> 245 0C (20 min)60C(10min) => 4C/min => 220C (10min) => 1C/min => 240C60C(10min) => 4C/min => 220C(10min) => 1C/min => 240C
I 1705.1687.1697.1706.1706.
ReferenceLoskos, Hernandez-Orte, et al., 2007Narain, Galvao, et al., 2007Selli, 2007Tabanca, Demirci, et al., 2007Tabanca N., Demirci B., et al., 2007
Comment MSDC-RI MSDC-RI MSDC-RI MSDC-RI MSDC-RI
Column type CapillaryCapillaryCapillaryCapillaryCapillary
Active phase DB-WaxDB-WaxFFAP-CBFFAPInnowax FSC
Column length (m) 30.30.25.25.60.
Carrier gas He HeliumHeHe
Substrate
Column diameter (mm) 0.250.250.320.320.25
Phase thickness (μm) 0.250.250.300.30.25
Program 50 0C (2 min) 6 0C/min -> 150 0C 8 0C/min -> 230 0C (15 min)40 0C (3 min) 3 0C/min -> 150 0C (2 min) 6 0C/min -> 230 0C (10 min)36 0C 20 0C/min -> 85 0C 1 0C/min -> 1345 0C 3 0C/min -> 250 0C36C => 20C/min => 85C => 1C/min => 145C => 3C/min => 250C60C(10min) => 4C/min => 220C (10min) => 1C/min => 240C
I 1680.1687.1706.1706.1706.
ReferenceTian, Zhang, et al., 2007Wenguang, Wenlai, et al., 2007Bailly, Jerkovic, et al., 2006Bailly, Jerkovic, et al., 2006, 2Baser K.H.C., Ozek G., et al., 2006
Comment MSDC-RI MSDC-RI MSDC-RI MSDC-RI MSDC-RI
Column type CapillaryCapillaryCapillaryCapillaryCapillary
Active phase HP-Innowax FSCHP-Innowax FSCInnowax FSCHP-Innowax FSCCarbowax 20M
Column length (m) 60.60.60.60.25.
Carrier gas N2HeN2HeH2
Substrate
Column diameter (mm) 0.250.250.250.250.32
Phase thickness (μm) 0.250.250.250.250.25
Program 60C(10min) => 4C/min => 220C(10min) => 1C/min => 240C60C(10min) => 4C/min => 220C (10min) => 1C/min => 240C60C(10min) => 4C/min => 220C(10min) => 1C/min => 240C60C(10min) => 4C/min => 220C (10min) => 1C/min => 240C40C(8min) => 3C/min => 180C => 20C/min => 230C (10min)
I 1706.1706.1706.1706.1662.
ReferenceDemirci B., Baser K.H.C., et al., 2006Erdurak, Coskun, et al., 2006Iscan, Kirimer, et al., 2006Kürkçüoglu, Hüsnü Can Baser, et al., 2006Lorenzo, Loayza, et al., 2006
Comment MSDC-RI MSDC-RI MSDC-RI MSDC-RI MSDC-RI
Column type CapillaryCapillaryCapillaryCapillaryCapillary
Active phase HP-InnowaxHP-InnowaxHP-Innowax FSCHP-Innowax FSCHP-Innowax FSC
Column length (m) 60.50.60.60.60.
Carrier gas NitrogenHeHe N2
Substrate
Column diameter (mm) 0.250.20.250.250.25
Phase thickness (μm) 0.250.20.250.250.25
Program 50 0C (4 min) -> 40 0C 4 0C/min -> 220 0C40C(5min) => 2C/min => 250C (15min) => 10C/min => 270C60(10min) => 4C/min => 220C(10min) => 1C/min => 240C60C(10min) => 4C/min => 220C (10min) => 1C/min => 240C60C(10min) => 4C/min => 220C => (10min) => 1C/min => 240C
I 1681.1706.1706.1706.1706.
ReferenceQuijano and Pino, 2006Senatore, Apostolides Arnold, et al., 2006Suleimenov Y.M., Atazhanova G.A., et al., 2006Tabanca, Demirci, et al., 2006Tabanca, Demirci, et al., 2006, 2
Comment MSDC-RI MSDC-RI MSDC-RI MSDC-RI MSDC-RI
Column type CapillaryCapillaryCapillaryCapillaryCapillary
Active phase DB-WaxHP-InnowaxHP-Innowax FSCHP-InnowaxCarbowax 20M
Column length (m) 30.60.60.60.
Carrier gas HeN2N2N2
Substrate
Column diameter (mm) 0.250.250.250.25
Phase thickness (μm) 0.250.250.250.25
Program not specified60C(10min) => 4C/min => 220C (10min) => 1C/min => 240C60C(10min) => 4C/min => 220C (10min) => 1C/min => 240C60C(10min) => 4C/min => 220C(10min) => 1C/min => 240Cnot specified
I 1661.1706.1706.1706.1670.
ReferenceBerlinet, Ducruet, et al., 2005Demirci, Demirci, et al., 2005Demirci, Demirci, et al., 2005, 2Duman, Kartal, et al., 2005Editorial paper, 2005
Comment MSDC-RI MSDC-RI MSDC-RI MSDC-RI MSDC-RI
Column type CapillaryCapillaryCapillaryCapillaryCapillary
Active phase Carbowax 20MDB-WaxInnowax FSCDB-WaxHP-Innowax FSC
Column length (m)  30.60. 60.
Carrier gas  HeHeN2He
Substrate
Column diameter (mm)  0.250.25 0.25
Phase thickness (μm)  0.250.25 0.25
Program not specified35C(5min) => 2C/min => 173C(1min) => 15C/min => 210C(5min)60C(10min) => 4C/min => 220C(10min) => 1C/min => 240Cnot specified60C(10min) => 4C/min => 220C(10min) => 1C/min => 240C
I 1685.1667.1706.1700.1707.
ReferenceEditorial paper, 2005Giuseppe, Manuela, et al., 2005Kosar, Özek, et al., 2005Pala-Paul, Perez-Alonso, et al., 2005Sezik E., Kocakulak E., et al., 2005
Comment MSDC-RI MSDC-RI MSDC-RI MSDC-RI MSDC-RI
Column type CapillaryCapillaryCapillaryCapillaryCapillary
Active phase HP-Innowax FSCInnowax FSCHP-Innowax FSCHP-Innowax FSCHP-Innowax FSC
Column length (m) 60.60.60.60.60.
Carrier gas HeHeHeHeHe
Substrate
Column diameter (mm) 0.250.250.250.250.25
Phase thickness (μm) 0.250.250.250.250.25
Program 60C(10min) => 4C/min => 220C(10min) => 1C/min => 240C60C(10min) => 4C/min => 220C(10min) => 1C/min => 240C60C(10min) => 4C/min => 220C(10min) => 1C/min => 240C60C(10min) => 4C/min => 220C(10min) => 1C/min => 240C60C(10min) => 4C/min => 220C(10min) => 1C/min => 240C
I 1706.1706.1706.1706.1706.
ReferenceViljoen, Subramoney, et al., 2005Baser, Özek, et al., 2004Demirci, Paper, et al., 2004Kivcak, Akay, et al., 2004Kivcak, Akay, et al., 2004
Comment MSDC-RI MSDC-RI MSDC-RI MSDC-RI MSDC-RI
Column type CapillaryCapillaryCapillaryCapillaryCapillary
Active phase HP-Innowax FSCCarbowax 20MCarbowax 20MInnowax FSCHP-Innowax FSC
Column length (m) 60.  60.60.
Carrier gas N2  HeHe
Substrate
Column diameter (mm) 0.25  0.250.25
Phase thickness (μm) 0.25  0.250.25
Program 60C(10min) => 4C/min => 220C(10min) => 1C/min => 240Cnot specifiednot specified60C(10min) => 4C/min => 220C (10min) => 1C/min => 240C60C (10min) => 4C/min => 220C (10min) => 1C/min => 240C
I 1706.1693.1691.1706.1706.
ReferenceKlika, Demirci, et al., 2004Vinogradov, 2004Vinogradov, 2004Baser, Demirci, et al., 2003Demirci, Baser, et al., 2003
Comment MSDC-RI MSDC-RI MSDC-RI MSDC-RI MSDC-RI
Column type CapillaryCapillaryCapillaryCapillaryCapillary
Active phase HP-Innowax FSCHP-Innowax FSCCarbowaxHP-Innowax FSCHP-Innowax FSC
Column length (m) 60.60. 60.60.
Carrier gas HeHe HeN2
Substrate
Column diameter (mm) 0.250.25 0.250.25
Phase thickness (μm) 0.250.25 0.250.25
Program 60C(10min) => 4C/min => 220C(10min) => 1C/min => 240C60C(10min) => 4C/min => 220C(10min) => 1C/min => 240Cnot specified60C(10min) => 4C/min => 220C(10min) => 1C/min => 240C60C(10min) => 4C/min => 220C(10min) => 1C/min => 240C
I 1706.1706.1665.1706.1706.
ReferenceDemirci, Dadandi, et al., 2003Demirci, Demirci, et al., 2003Edris, Shalaby, et al., 2003Erdemoglu, Sener, et al., 2003Kaya, Demirci, et al., 2003
Comment MSDC-RI MSDC-RI MSDC-RI MSDC-RI MSDC-RI
Column type CapillaryCapillaryCapillaryCapillaryCapillary
Active phase HP-Innowax FSCHP-FFAPCarbowax 20MDB-WaxHP Innowax FSP
Column length (m) 60.30.50.30.60.
Carrier gas HeHeHeliumHeHe
Substrate
Column diameter (mm) 0.250.250.700.320.25
Phase thickness (μm) 0.25  0.50.25
Program 60C(10min) => 4C/min => 220C(10min) => 1C/min => 240C(40min)60C (2min) => 5C/min => 160C (1min) => 10C/min => 230C (12min)not specified60C(2min) => 2C/min => 220C => 3C/min => 245C(20min)60C(10min) => 4C/min => 220C (10min) => 1C/min => 240C
I 1706.1732.1661.1679.1706.
ReferenceKürkcüoglu, Demirci, et al., 2003Mockute and Judzentiene, 2003Saura, LAencina, et al., 2003Selli, Cabaroglu, et al., 2003Tasdemir, Demirci, et al., 2003
Comment MSDC-RI MSDC-RI MSDC-RI MSDC-RI MSDC-RI
Column type CapillaryCapillaryCapillaryCapillaryCapillary
Active phase HP Innowax FSPInnowaxHP-InnowaxHP-InnowaxInnowax FSC
Column length (m) 60.60.60.60.60.
Carrier gas HeHe HeHe
Substrate
Column diameter (mm) 0.250.250.250.250.25
Phase thickness (μm) 0.250.250.250.250.25
Program 60C(10min) => 4C/min => 220C (10min) => 1C/min => 240C60C(10min) => 4C/min => 220C(10min) => 1C/min => 240C (20min)60C(10min) => 4C/min => 220C(10min) => 1C/min => 240C60 0C (10 min) 4 K/min -> 220 0C (10 min) 1 K/min -> 240 0C60C(10min) => 4C/min => 220C(10min) => 1C/min => 240C
I 1706.1706.1706.1707.1706.
ReferenceTasdemir, Demirci, et al., 2003Tunaher, Kirimer, et al., 2003Viljoen, van Vuuren, et al., 2003Baser, Demirci, et al., 2002Baser, Demirei, et al., 2002
Comment MSDC-RI MSDC-RI MSDC-RI MSDC-RI MSDC-RI
Column type CapillaryCapillaryCapillaryCapillaryCapillary
Active phase InnowaxHP-InnowaxHP-Innowax FSCSupelcowax-10HP-FFAP
Column length (m) 60.60.60.60.25.
Carrier gas HeHeN2HeHe
Substrate
Column diameter (mm) 0.250.250.250.250.22
Phase thickness (μm) 0.250.250.250.25
Program 60C(10min) => 4C/min => 220C(10min) => 1C/min => 240C60 0C (10 min) 4 K/min -> 220 0C (10 min) 1 K/min -> 240 0C60C(10min) => 4C/min => 220C(10min) => 1C/min => 240C40C (7min) => 4C/min => 150C => 8C/min => 240C (10min)60C(2min) => 5C/min => 160C(1min) => 10C/min => 230C(12min)
I 1706.1706.1706.1730.1732.
ReferenceBaser, Nuriddinov, et al., 2002Demirci, Baser, et al., 2002Hüsnü Can Baser, Demirci, et al., 2002Kim and Lee, 2002Mockute and Judzentiene, 2002
Comment MSDC-RI MSDC-RI MSDC-RI MSDC-RI MSDC-RI
Column type CapillaryCapillaryCapillaryCapillaryCapillary
Active phase TRWAXInnowax FSCHP-InnowaxHP-InnowaxHP-Innowax FSC
Column length (m) 60.60.60.60.60.
Carrier gas He HeHe
Substrate
Column diameter (mm) 0.250.250.250.250.25
Phase thickness (μm) 0.250.250.250.250.25
Program not specified60C(10min) => 4C/min => 220C(10min) => 1C/min => 240C60 0C (10 min) 10 K/min -> 220 0C (10 min) 1K/min -> 240 0C60 0C (10 min) 4 K/min -> 220 0C (10 min) 1 K/min -> 240 0C60C(10min) => 4C/min => 220C(10min) => 1C/min => 240C
I 1728.1707.1706.1706.1706.
ReferenceTorrens, 2002Tunalier, Kirimer, et al., 2002Baser, Demirci, et al., 2001Gören, Demirci, et al., 2001Kaya, Demirci, et al., 2001
Comment MSDC-RI MSDC-RI MSDC-RI MSDC-RI MSDC-RI
Column type CapillaryCapillaryCapillaryCapillaryCapillary
Active phase HP-Innowax FSCHP-Innowax FSCDB-WaxDB-WaxInnowax
Column length (m) 60.60.30.30.60.
Carrier gas HeHe  He
Substrate
Column diameter (mm) 0.250.250.250.250.25
Phase thickness (μm) 0.250.250.250.250.25
Program 60C(10min) => 4C/min => 220C(10min) => 1C/min => 240C60C(10min) => 4C/min => 220C(10min) => 1C/min => 240C50C(4min) => 4C/min => 130C => 1C/min => 190C => 4C/min => 220C(20min)50C(4min) => 4C/min => 130C => 1C/min => 190C => 4C/min => 220C(20min)60C(10min) => 4C/min => 200C(10min) => 1C/min => 240C
I 1706.1706.1675.1679.1707.
ReferenceKirimer N., Tabanea N., et al., 2001Kivcak B., Mert T., et al., 2001Mayorga, Knapp, et al., 2001Mayorga, Knapp, et al., 2001Özcan, Akgül, et al., 2001
Comment MSDC-RI MSDC-RI MSDC-RI MSDC-RI MSDC-RI
Column type CapillaryCapillaryCapillaryCapillaryCapillary
Active phase Supelcowax-10Innowax FSCDB-WaxInnowax FSCHP-Innowax FSC
Column length (m) 60.60.30.60.60.
Carrier gas  HeHeHe
Substrate
Column diameter (mm) 0.250.250.250.250.25
Phase thickness (μm) 0.250.250.50.250.25
Program 40C(20min) => 1.5C/min => 200C(4min) => 10C/min => 250C(120min)60C(10min) => 4C/min => 220C(10min) => 1C/min => 240C30C => 70C/min => 60C (3min) => 3C/min => 245C (20min)60C(10min) => 4C/min => 220C(10min) => 1C/min => 240C60C(10min) => 4C/min => 220C(10min) => 1C/min => 240C
I 1694.1706.1698.1706.1707.
ReferenceRogerson, Castro, et al., 2001Saglam, Gozler, et al., 2001Schneider, Razungles, et al., 2001Tabanca N., Demirci F., et al., 2001Tabanca, Kirimer, et al., 2001
Comment MSDC-RI MSDC-RI MSDC-RI MSDC-RI MSDC-RI
Column type CapillaryCapillaryCapillaryCapillaryCapillary
Active phase HP-InnowaxFFAPHP-WaxInnowaxInnowax
Column length (m) 60.50.60.60.60.
Carrier gas He HeHeHe
Substrate
Column diameter (mm) 0.250.20.250.250.25
Phase thickness (μm) 0.250.330.25 0.25
Program 60C(10min) => 4C/min => 220C(10min) => 1C/min => 240C60C(1min) => 2.5C/min => 115C => 1C/min => 210C(30min)50 0C 3 K/min -> 200 0C 8 K/min -> 280 0C60 0C (10 min) 4 K/min -> 220 0C (10 min) 1 K/min -> 240 0C60 0C (10 min) 4 K/min -> 220 0C (10 min) 1 K/min -> 240 0C
I 1706.1686.1729.1706.1707.
ReferenceTabanca, Kirimer, et al., 2001, 2Tucker, Maciarello, et al., 2001Usubillaga, Aparicio, et al., 2001Ahmed, Choudhary, et al., 2000Baser, Özek, et al., 2000
Comment MSDC-RI MSDC-RI MSDC-RI MSDC-RI MSDC-RI
Column type CapillaryCapillaryCapillaryCapillaryCapillary
Active phase InnowaxInnowax FSCFFAPSupelcowax-10HP-Innowax FSC
Column length (m) 60.60.50. 60.
Carrier gas HeHeN2 He
Substrate
Column diameter (mm) 0.250.250.2 0.25
Phase thickness (μm) 0.250.250.33 0.25
Program 60 0C (10 min) 4 K/min -> 220 0C (10 min) 1 K/min -> 240 0C60C(10 min) => 4C/min => 220C(10min) => 1C/min => 240C70C(1min) => 3C/min => 142C(2min) => 25C/min => 230C(5min)not specified60C(10min) => 4C/min => 220C(10min) => 1C/min => 240C
I 1707.1707.1723.1714.1707.
ReferenceBaser, Tabanca, et al., 2000Kirimer, Tabanca, et al., 2000Lopez, Lavilla, et al., 2000Zunino, Lopez, et al., 2000Bagci, Baser, et al., 1999
Comment MSDC-RI MSDC-RI MSDC-RI MSDC-RI MSDC-RI
Column type CapillaryCapillaryCapillaryCapillaryCapillary
Active phase HP-Innowax FSCInnowax FSCFFAPDB-WaxDB-Wax
Column length (m) 60.60.25.60.60.
Carrier gas HeHeliumH2N2N2
Substrate
Column diameter (mm) 0.250.250.2
Phase thickness (μm) 0.250.250.330.250.25
Program 60C(10min) => 4C/min => 220C(10min) => 1C/min => 240C(20min)60 0C (10 min) 4 0C/min -> 220 0C (10 min) 1 0C/min -> 240 0C40C(5min) => 4C/min => 170C => 8C/min => 240C (12min)not specifiednot specified
I 1707.1707.1691.1700.1709.
ReferenceKamariah, Lim, et al., 1999Kirimer, Tabanca, et al., 1999Reddy, Angers, et al., 1998Weyerstahl, Marschall, et al., 1998Weyerstahl, Marschall, et al., 1998, 2
Comment MSDC-RI MSDC-RI MSDC-RI MSDC-RI MSDC-RI
Column type CapillaryCapillaryCapillaryCapillaryCapillary
Active phase DB-WaxCP-Wax 52CBSupelcowax 10Supelcowax 10Supelcowax 10
Column length (m) 60.25.60.60.60.
Carrier gas HeH2HeliumHeliumHelium
Substrate
Column diameter (mm) 0.250.30.250.250.25
Phase thickness (μm)  1.20.250.250.25
Program 45C(4min) => 30C/min => 60C (5min) => 3C/min => 220C(40min)60C(3min) => 2C/min => 220C => 3C/min => 245C60 0C (10 min) 2 0C/min -> 80 0C 3 0C/min -> 100 0C 4 0C/min -> 220 0C (30 min)not specifiednot specified
I 1711.1697.1688.1688.1698.
ReferenceZiegleder, 1998López-Tamames, Carro-Mariño, et al., 1997Castioni and Kapetanidis, 1996Castioni and Kapetanidis, 1996Castioni and Kapetanidis, 1996
Comment MSDC-RI MSDC-RI MSDC-RI MSDC-RI MSDC-RI
Column type CapillaryCapillaryCapillaryCapillaryCapillary
Active phase CP-Wax 52 CBCarbowax 20MSupelcowaxCarbowax 20MNB-351
Column length (m) 30.60.30. 25.
Carrier gas H2He He
Substrate
Column diameter (mm) 0.320.250.25 0.32
Phase thickness (μm)  0.25  0.2
Program 60 0C 2 0C/min -> 220 0C 3 0C/min -> 245 0Cnot specifiednot specifiednot specified40C(5min) => 4C/min => 150C => 8C/min => 240C(12min)
I 1697.1740.1684.1661.1695.
ReferenceCarro Marino, López Tamames, et al., 1995Tirado, Stashenko, et al., 1995Garneau, Bouhajib, et al., 1994Chanegriha and Baaliouamer, 1993Kerrola and Kallio, 1993
Comment MSDC-RI MSDC-RI MSDC-RI MSDC-RI MSDC-RI
Column type CapillaryCapillaryCapillaryCapillaryCapillary
Active phase DB-WaxDB-WaxSupelcowax-10CP-Wax 52CBPolyethylene Glycol
Column length (m) 30.30.30.50.
Carrier gas He
Substrate
Column diameter (mm) 0.250.250.530.32
Phase thickness (μm)  0.250.25
Program not specifiednot specified80C(5min) => 5C/min => 155C => 4C/min => 240C(30min)not specifiednot specified
I 1671.1687.1708.1680.1687.
ReferenceHatsuko, Kazuko, et al., 1992Marlatt, Ho, et al., 1992Miranda-Lopez, Libbey, et al., 1992Vernin, 1991Vernin, Metzger, et al., 1990
Comment MSDC-RI MSDC-RI MSDC-RI MSDC-RI MSDC-RI
Column type CapillaryCapillaryCapillary
Active phase DB-WaxCarbowax 20MPolyethylene Glycol
Column length (m) 60.
Carrier gas
Substrate
Column diameter (mm) 0.32
Phase thickness (μm)
Program not specifiednot specifiednot specified
I 1695.1661.1661.
ReferenceBinder and Flath, 1989Shibamoto, 1987MacLeod and Pieris, 1981
Comment MSDC-RI MSDC-RI MSDC-RI

Kovats' RI, polar column, custom temperature program

Data compiled by: NIST Mass Spectrometry Data Center, William E. Wallace, director

Column type CapillaryCapillary
Active phase HP-InnowaxCarbowax
Column length (m) 30.127.
Carrier gas H2
Substrate
Column diameter (mm) 0.320.75
Phase thickness (μm) 0.50
Program 60 0C (8 min) 3 K/min -> 180 0C 20 K/min -> 230 0C (20 min)not specified
I 1710.1712.
ReferenceFrizzo, Serafini, et al., 2001Okamoto, Ellison, et al., 1981
Comment MSDC-RI MSDC-RI

References

Bruni, Bianchi, et al., 2007
Bruni, R.; Bianchi, A.; Bellardi, M.G., Essential oil composition of Agastache anethiodora Britton (Lamiaceae) infected by cucumber mosaic virus (CMV), Flavour Fragr. J., 2007, 22, 1, 66-70, https://doi.org/10.1002/ffj.1760 . [all data]

Dharmawan, Kasapis, et al., 2007
Dharmawan, J.; Kasapis, S.; Curran, P.; Johnson, J.R., Characterization of volatile compounds in selected citrus fruits from Asia. Part I: freshly-squeezed juice, Flavour Fragr. J., 2007, 22, 3, 228-232, https://doi.org/10.1002/ffj.1790 . [all data]

Pérez, Navarro, et al., 2007
Pérez, R.A.; Navarro, T.; de Lorenzo, C., HS-SPME analysis of the volatile compounds from spices as a source of flavour in 'Campo Real' table olive preparations, Flavour Fragr. J., 2007, 22, 4, 265-273, https://doi.org/10.1002/ffj.1791 . [all data]

Carasek and Pawliszyn, 2006
Carasek, E.; Pawliszyn, J., Screening of Tropical Fruit Volatile Compounds Using Solid-Phase Microextraction (SPME) Fibers and Internally Cooled SPME Fiber, J. Agric. Food Chem., 2006, 54, 23, 8688-8696, https://doi.org/10.1021/jf0613942 . [all data]

Cardeal, da Silva, et al., 2006
Cardeal, Z.L.; da Silva, M.D.R.G.; Marriott, P.J., Comprehensive two-dimensional gas chromatography/mass spectrometric analysis of pepper volatiles, Rapid Commun. Mass Spectrom., 2006, 20, 19, 2823-2836, https://doi.org/10.1002/rcm.2665 . [all data]

Guerrini, Sacchetti, et al., 2006
Guerrini, A.; Sacchetti, G.; Muzzoli, M.; Rueda, G.M.; Medici, A.; Besco, E.; Bruni, R., Composition of the Volatile Fraction of Ocotea bofo Kunth (Lauraceae) Calyces by GC-MS and NMR Fingerprinting and Its Antimicrobial and Antioxidant Activity, J. Agric. Food Chem., 2006, 54, 20, 7778-7788, https://doi.org/10.1021/jf0605493 . [all data]

Özel, Gögüs, et al., 2006
Özel, M.Z.; Gögüs, F.; Lewis, A.C., Determination of Teucrium chamaedrys volatiles by using direct thermal desorption-comprehensive two-dimensional gas chromatography-time-of-flight mass spectrometry, J. Chromatogr. A, 2006, 1114, 1, 164-169, https://doi.org/10.1016/j.chroma.2006.02.036 . [all data]

Sacchetti, Guerrini, et al., 2006
Sacchetti, G.; Guerrini, A.; Noriega, P.; Bianchi, A.; Bruni, R., Essential oil of wild Ocotea quixos (Lam.) Kosterm. (Lauraceae) leaves from Amazonian Ecuador, Flavour Fragr. J., 2006, 21, 4, 674-676, https://doi.org/10.1002/ffj.1648 . [all data]

Sampaio and Nogueira, 2006
Sampaio, T.S.; Nogueira, P.C.L., Volatile components of mangaba fruit (Hancornia speciosa Gomes) at three stages of maturity, Food Chem., 2006, 95, 4, 606-610, https://doi.org/10.1016/j.foodchem.2005.01.038 . [all data]

Suliman F.E.O., Fatope M.O., et al., 2006
Suliman F.E.O.; Fatope M.O.; Al-Saidi S.H.; Al-Kindy S.M.Z.; Marwah R.G., Composition and antimicrobial activity of the essential oil of Pluchea arabica from Oman, Flavour Fragr. J., 2006, 21, 3, 469-471, https://doi.org/10.1002/ffj.1616 . [all data]

Akpulat, Tepe, et al., 2005
Akpulat, H.A.; Tepe, B.; Sokmen, A.; Daferera, D.; Polissiou, M., Composition of the essential oils of Tanacetum argyrophyllum (C. Koch) Tvzel. var. argyrophyllum and Tanacetum parthenium (L.) Schultz Bip. (Asteraceae) from Turkey, Biochem. Syst. Ecol., 2005, 33, 5, 511-516, https://doi.org/10.1016/j.bse.2004.10.006 . [all data]

Bruni, Pellati, et al., 2005
Bruni, R.; Pellati, F.; Grazia Bellardi, M.; Benvenuti, S.; Paltrinieri, S.; Bertaccini, A.; Bianchi, A., Herbal drug quality and phytochemical composition of Hypericum perforatum L. affected by ash yellows phytoplasma infection, J. Agric. Food Chem., 2005, 53, 4, 964-968, https://doi.org/10.1021/jf0487654 . [all data]

Gopanraj, Dan, et al., 2005
Gopanraj; Dan, M.; Shiburaj, S.; Sethuraman, M.G.; George, V., Chemical composition and antibacterial activity of the rhizome oil of Hedychium larsenii, Acta Pharm. Sin., 2005, 55, 315-320. [all data]

Oliveira, Campos, et al., 2005
Oliveira, M.J.; Campos, I.F.P.; Oliveira, C.B.A.; Santos, M.R.; Souza, P.S.; Santos, S.C.; Seraphin, J.C.; Ferri, P.H., Influence of growth phase on the essential oil composition of Hyptis suaveolens, Biochem. Syst. Ecol., 2005, 33, 3, 275-285, https://doi.org/10.1016/j.bse.2004.10.001 . [all data]

Sacchetti, Maietti, et al., 2005
Sacchetti, G.; Maietti, S.; Muzzoli, M.; Scaglianti, M.; Manfredini, S.; Radice, M.; Bruni, R., Comparative evaluation of 11 essential oils of different origin as functional antioxidants, antiradicals and antimicrobials in foods, Food Chem., 2005, 91, 4, 621-632, https://doi.org/10.1016/j.foodchem.2004.06.031 . [all data]

Zheng, Kim, et al., 2005
Zheng, C.H.; Kim, K.H.; Kim, T.H.; Lee, H.J., Analysis and characterization of aroma-active compounds of Schizandra chinensis (omija) leaves, J. Sci. Food Agric., 2005, 85, 1, 161-166, https://doi.org/10.1002/jsfa.1975 . [all data]

Bell, 2004
Bell, W.A.-M., Examination of Aroma Volatiles Formed from Thermal Processing of Florida Reconstituted Grapefruit Juice. A Thesis presented to the graduate school of the university of Florida in partial fulfillment of the requirements for the degree of master of science, 2004. [all data]

Díaz-Maroto, Sánchez Palomo, et al., 2004
Díaz-Maroto, M.C.; Sánchez Palomo, E.; Castro, L.; González Viñas, M.A.; Pérez-Coello, M.S., Changes produced in the aroma compounds and structural integrity of basil (Ocimum basilicum L) during drying, J. Sci. Food Agric., 2004, 84, 15, 2070-2076, https://doi.org/10.1002/jsfa.1921 . [all data]

Frizzo, Lorenzo, et al., 2004
Frizzo, C.D.; Lorenzo, D.; Dellacassa, E., Composition and seasonal variation of the essential oils from two mandarin cultivars of Southern Brazil, J. Agric. Food Chem., 2004, 52, 10, 3036-3041, https://doi.org/10.1021/jf030685x . [all data]

Klesk, Qian, et al., 2004
Klesk, K.; Qian, M.; Martin, R.R., Aroma extract dilution analysis of cv. meeker (Rubus idaeus L.) red raspberries from Oregon and Washington, J. Agric. Food Chem., 2004, 52, 16, 5155-5161, https://doi.org/10.1021/jf0498721 . [all data]

Lorenzo, Paz, et al., 2004
Lorenzo, D.; Paz, D.; Davies, P.; Villamil, J.; Vila, R.; Cañigueral, S.; Dellacassa, E., Characterization and enantiomeric distribution of some terpenes in the essential oil of a Uruguayan biotype of Salvia sclarea L., Flavour Fragr. J., 2004, 19, 4, 303-307, https://doi.org/10.1002/ffj.1282 . [all data]

Sacchetti, Medici, et al., 2004
Sacchetti, G.; Medici, A.; Maietti, S.; Radice, M.; Muzzoli, M.; Manfredini, S.; Braccioli, E.; Bruni, R., Composition and functional properties of the essential oil of Amazonian basil, Ocimum micranthum Willd., Labiatae in comparison with commercial essential oils, J. Agric. Food Chem., 2004, 52, 11, 3486-3491, https://doi.org/10.1021/jf035145e . [all data]

Kim, Lee, et al., 2003
Kim, T.H.; Lee, S.M.; Kim, Y.-S.; Kim, K.H.; Oh, S.; Lee, H.J., Aroma dilution method using GC injector split ratio for volatile compounds extracted by headspace solid phase microextraction, Food Chem., 2003, 83, 1, 151-158, https://doi.org/10.1016/S0308-8146(03)00221-8 . [all data]

Lorenzo, Loayza, et al., 2003
Lorenzo, D.; Loayza, I.; Dellacassa, E., Composition of the essential oils from leaves of two Hedyosmum spp. from Bolivia, Flavour Fragr. J., 2003, 18, 1, 32-35, https://doi.org/10.1002/ffj.1146 . [all data]

Mockute and Judzentiene, 2003
Mockute, D.; Judzentiene, A., Variability of the essential oils composition of Achillea millefolium ssp. millefolium growing wild in Lithuania, Biochem. Syst. Ecol., 2003, 31, 9, 1033-1045, https://doi.org/10.1016/S0305-1978(03)00066-8 . [all data]

Passos X.S., Castro A.C.M., et al., 2003
Passos X.S.; Castro A.C.M.; Pires J.S.; Garcia A.C.F.; Campos F.C.; Fernandes O.F.L.; Paula J.R.; Ferreira H.D.; Santos S.C.; Ferri P.H.; Silva M.D.R., Composition and antifungal activity of the essential oils of Caryocar brasiliensis, Pharm. Biol., 2003, 41, 5, 319-324, https://doi.org/10.1076/phbi.41.5.319.15936 . [all data]

Azevedo, Campos, et al., 2002
Azevedo, N.R.; Campos, I.F.P.; Ferreira, H.D.; Portes, T.A.; Seraphin, J.C.; de Paula, J.R.; Santos, S.C.; Ferri, P.H., Essential oil chemotypes in Hyptis suaveolens from Brazilian Cerrado, Biochem. Syst. Ecol., 2002, 30, 3, 205-216, https://doi.org/10.1016/S0305-1978(01)00075-8 . [all data]

García, Alvarez, et al., 2002
García, D.; Alvarez, A.; Tornos, P.; Fernandez, A.; Sáenz, T., Gas chromatographic-mass spectrometry study of the essential oils of Pimenta racemosa var. terebinthina and P. racemosa var. grisea, Z. Naturforsch., 2002, 57c, 449-451. [all data]

Lorenzo, Paz, et al., 2002
Lorenzo, D.; Paz, D.; Dellacassa, E.; Davies, P.; Vila, R.; Cañigueral, S., Essential oils of Mentha pulegium and Mentha rotundifolia from Uruguay, Braz. Arch. Biol. Technol., 2002, 45, 4, 519-524, https://doi.org/10.1590/S1516-89132002000600016 . [all data]

Cavalli, Ranarivelo, et al., 2001
Cavalli, J.-F.; Ranarivelo, L.; Ratsimbason, M.; Bernardini, A.-F.; Casanova, J., Constituents of the essential oil of six Helichrysum species from Madagascar, Flavour Fragr. J., 2001, 16, 4, 253-256, https://doi.org/10.1002/ffj.994 . [all data]

Lorenzo, Dellacassa, et al., 2001
Lorenzo, D.; Dellacassa, E.; Bonaccorsi, I.; Mondello, L., Uruguayan essential oils. Composition of leaf oil of Myrcianthes cisplatensis (Camb.) Berg. ('Guayabo colorado') (Myrtaceae), Flavour Fragr. J., 2001, 16, 2, 97-99, https://doi.org/10.1002/1099-1026(200103/04)16:2<97::AID-FFJ952>3.0.CO;2-C . [all data]

Lorenzo, Saavedra, et al., 2001
Lorenzo, D.; Saavedra, G.; Loayza, I.; Dellacassa, E., Composition of the essential oil of Erechtites hieracifolia from Bolivia, Flavour Fragr. J., 2001, 16, 5, 353-355, https://doi.org/10.1002/ffj.1010 . [all data]

Boulanger and Crouzet, 2000
Boulanger, R.; Crouzet, J., Free and bound flavour components of Amazonian fruits: 2. cupuacu volatile compounds, Flavour Fragr. J., 2000, 15, 4, 251-257, https://doi.org/10.1002/1099-1026(200007/08)15:4<251::AID-FFJ905>3.0.CO;2-2 . [all data]

Boulanger and Crouzet, 2000, 2
Boulanger, R.; Crouzet, J., Free and bound flavour components of Amazonian fruits: 3-glycosidically bound components of cupuacu, Food Chem., 2000, 70, 4, 463-470, https://doi.org/10.1016/S0308-8146(00)00112-6 . [all data]

Eri, Khoo, et al., 2000
Eri, S.; Khoo, B.K.; Lech, J.; Hartman, T.G., Direct thermal desorption-gas chromatography and gas chromatography-mass spectrometry profiling of hop (Humulus lupulus L.) essential oils in support of varietal characterization, J. Agric. Food Chem., 2000, 48, 4, 1140-1149, https://doi.org/10.1021/jf9911850 . [all data]

Filippini, Tomi, et al., 2000
Filippini, M.-H.; Tomi, F.; Casanova, J., Composition of the leaf oil of Ferula arrigonii Bocchieri, Flavour Fragr. J., 2000, 15, 3, 195-198, https://doi.org/10.1002/1099-1026(200005/06)15:3<195::AID-FFJ891>3.0.CO;2-6 . [all data]

Lorenzo, Dellacassa, et al., 2000
Lorenzo, D.; Dellacassa, E.; Atti-Serafini, L.; Santos, A.C.; Frizzo, C.; Paroul, N.; Moyna, P.; Mondello, L.; Dugo, G., Composition and stereoanalysis of Cymbopogon winterianus Jowitt oil from Southern Brazil, Flavour Fragr. J., 2000, 15, 3, 177-181, https://doi.org/10.1002/1099-1026(200005/06)15:3<177::AID-FFJ887>3.0.CO;2-M . [all data]

Boulanger, Chassagne, et al., 1999
Boulanger, R.; Chassagne, D.; Crouzet, J., Free and bound flavour components of amazonian fruits. 1: Bacuri, Flavour Fragr. J., 1999, 14, 5, 303-311, https://doi.org/10.1002/(SICI)1099-1026(199909/10)14:5<303::AID-FFJ834>3.0.CO;2-C . [all data]

Loayza, de Groot, et al., 1999
Loayza, I.; de Groot, W.; Lorenzo, D.; Dellacassa, E.; Mondello, L.; Dugo, G., Composition of the essential oil of Porophyllum ruderale (Jacq.) Cass. from Bolivia, Flavour Fragr. J., 1999, 14, 6, 393-398, https://doi.org/10.1002/(SICI)1099-1026(199911/12)14:6<393::AID-FFJ849>3.0.CO;2-5 . [all data]

Tairu, Hofmann, et al., 1999
Tairu, A.O.; Hofmann, T.; Schieberle, P., Characterization of the key aroma compounds in dried fruits of the West African peppertree Xylopia aethiopica (Dunal) A. Rich (Annonaceae) using aroma extract dilution analysis, J. Agric. Food Chem., 1999, 47, 8, 3285-3287, https://doi.org/10.1021/jf990228+ . [all data]

Tairu, Hofmann, et al., 1999, 2
Tairu, A.O.; Hofmann, T.; Schieberle, P., Identification of the key aroma compounds in dried fruits of Xylopia aethiopica in Perspectives on new crops and new users, Janick, J., ed(s)., ASHS Press, Alexandria, VA, USA, 1999, 474-478. [all data]

Chanegriha, Baaliouamer, et al., 1998
Chanegriha, N.; Baaliouamer, A.; Rolando, C., Polarity changes during capillary gas chromatographic and gas chromatographic-mass spectrometric analysis using serially coupled columns of different natures and temperature programming. Application to the identification of constituents of essential oils, J. Chromatogr. A, 1998, 819, 1-2, 61-65, https://doi.org/10.1016/S0021-9673(98)00449-X . [all data]

Yasuhara, Shiraishi, et al., 1997
Yasuhara, A.; Shiraishi, H.; Nishikawa, M.; Yamamoto, T.; Uehiro, T.; Nakasugi, O.; Okumura, T.; Kenmotsu, K.; Fukui, H.; Nagase, M.; Ono, Y.; Kawagoshi, Y.; Baba, K.; Noma, Y., Determination of organic components in leachates from hazardous waste disposal sites in Japan by gas chromatography-mass spectrometry, J. Chromatogr. A, 1997, 774, 1-2, 321-332, https://doi.org/10.1016/S0021-9673(97)00078-2 . [all data]

Mondello, Dugo, et al., 1995
Mondello, L.; Dugo, P.; Basile, A.; Dugo, G., Interactive use of linear retention indices, on polar and apolar columns, with a MS-library for reliable identification of complex mixtures, J. Microcolumn Sep., 1995, 7, 6, 581-591, https://doi.org/10.1002/mcs.1220070605 . [all data]

Triqui and Reineccius, 1995
Triqui, R.; Reineccius, G.A., Changes in flavor profiles with ripening of anchovy (Engraulis encrasicholus), J. Agric. Food Chem., 1995, 43, 7, 1883-1889, https://doi.org/10.1021/jf00055a024 . [all data]

Sing, Smadja, et al., 1992
Sing, A.S.C.; Smadja, J.; Brevard, H.; Maignial, L.; Chaintreau, A.; Marion, J.-P., Volatile constituents of faham (Jumellea fragrans (Thou.) Schltr.), J. Agric. Food Chem., 1992, 40, 4, 642-646, https://doi.org/10.1021/jf00016a024 . [all data]