N-Ethyl-N-methylpropanamide

Condensed phase thermochemistry data

Data compiled by: Hussein Y. Afeefy, Joel F. Liebman, and Stephen E. Stein

Quantity Value Units Method Reference Comment
Δcliquid-3883. ± 0.4kJ/molCcbKozina and Skuratov, 1959

References

Kozina and Skuratov, 1959
Kozina, M.P.; Skuratov, S.M., The enthalphy of polymerization of N-substituted lactames, Dokl. Akad. Nauk SSSR, 1959, 127, 561-563. [all data]