Cyclopentadecane, 1,1,4,4,7,7,10,10,13,13-decamethyl-

Reaction thermochemistry data

Data compiled by: Hussein Y. Afeefy, Joel F. Liebman, and Stephen E. Stein

Individual Reactions

10Hydrogen + Decamethyl-[5]pericyclyne = C25H50

By formula: 10H2 + C25H30 = C25H50

Quantity Value Units Method Reference Comment
Δr-340.7 ± 2.2kcal/molChydScott, Cooney, et al., 1988liquid phase; solvent: Hydrocarbon

References

Scott, Cooney, et al., 1988
Scott, L.T.; Cooney, M.J.; Rogers, D.W.; Dejroongruang, K., Homoaromaticity in a cyclic polyacetylene, J. Am. Chem. Soc., 1988, 110, 7244-7245. [all data]