1,10-Dithia[10]ferrocenophane

Gas phase ion energetics data

Data compiled by: Sharon G. Lias and Joel F. Liebman

Ionization energy determinations

IE (eV) Method Reference Comment
6.4PEVondrak and Sato, 1989
6.70PEVondrak and Sato, 1989Vertical value

References

Vondrak and Sato, 1989
Vondrak, T.; Sato, M., Orbital interactions in 1,n-dithial[n]ferrocenophanes: a He(I) photoelectron spectroscopic study, J. Organomet. Chem., 1989, 364, 207. [all data]