2-Furfurylthiol

Van Den Dool and Kratz RI, non-polar column, custom temperature program

Data compiled by: NIST Mass Spectrometry Data Center, William E. Wallace, director

Column type CapillaryCapillaryCapillaryCapillaryCapillary
Active phase DB-5HP-5DB-5CP-Sil 8CB-MSSE-54
Column length (m)  50.30.60.30.
Carrier gas   HeHe
Substrate
Column diameter (mm)  0.320.320.250.32
Phase thickness (μm)  1.050.250.250.25
Program not specified35C(5min) => 10C/min => 150C => 20C/min => 250C(10 min)40C (2min) => 40C/min => 60C (1min) => 6C/min => 230C (15min)0C(5min) => 40C/min => 40C (2min) => 4C/min => 280C35C(2min) => 40C/min => 50C(5min) => 6C/min => 230C(15min)
I 907.914.908.918.909.
ReferenceEscudero, Campo, et al., 2007Carrapiso, Ventanas, et al., 2002Engel and Schieberle, 2002Elmore, Mottram, et al., 2000Hofmann and Schieberle, 1998
Comment MSDC-RI MSDC-RI MSDC-RI MSDC-RI MSDC-RI
Column type CapillaryCapillaryCapillaryCapillaryCapillary
Active phase SE-54SE-54SE-54SE-54DB-5
Column length (m) 30.30.30.30.50.
Carrier gas HeHeHeHeHe
Substrate
Column diameter (mm) 0.320.320.320.320.32
Phase thickness (μm) 0.250.250.250.25
Program 40C (2min) => 40C/min => 50C (5min) => 6C/min => 230C (15min)40C (2min) => 40C/min => 50C (5min) => 6C/min => 230C (15min)40C (2min) => 40C/min => 50C (2min) => 240C (10min)40C (2min) => 40C/min => 50C (5min) => 6C/min => 230C (15min)0C => 60C/min => 60C (5min) => 4C/min => 250C
I 909.909.910.909.913.
ReferenceHofmann and Schieberle, 1997Hofmann and Schieberle, 1997Münch, Hofmann, et al., 1997Hofmann and Schieberle, 1995Mottram and Whitfield, 1995
Comment MSDC-RI MSDC-RI MSDC-RI MSDC-RI MSDC-RI

Van Den Dool and Kratz RI, polar column, temperature ramp

Data compiled by: NIST Mass Spectrometry Data Center, William E. Wallace, director

Column type CapillaryCapillaryCapillaryCapillaryCapillary
Active phase FFAPCP-Wax 52CBCP-Wax 52CBCP-Wax 52CBSupelcowax-10
Column length (m) 30.50.50.50.30.
Carrier gas     He
Substrate
Column diameter (mm) 0.320.320.320.320.25
Phase thickness (μm) 0.25   0.25
Tstart (C) 40.60.60.60.50.
Tend (C) 240.220.220.220.230.
Heat rate (K/min) 6.4.4.4.3.
Initial hold (min) 2.5.5.5.
Final hold (min) 10.30.30.30.30.
I 1417.1432.1437.1425.1424.
ReferenceSteinhaus and Schieberle, 2007Mahadevan and Farmer, 2006Mahadevan and Farmer, 2006Mahadevan and Farmer, 2006Moreira, Trugo, et al., 2002
Comment MSDC-RI MSDC-RI MSDC-RI MSDC-RI MSDC-RI
Column type CapillaryCapillaryCapillaryCapillaryCapillary
Active phase DB-WaxDB-WaxCP-Wax 52CBCP-Wax 52CBCP-Wax 52CB
Column length (m) 30.30.50.50.50.
Carrier gas HeHeH2
Substrate
Column diameter (mm) 0.320.530.320.320.32
Phase thickness (μm) 1.1.
Tstart (C) 40.40.50.60.40.
Tend (C) 200.200.200.220.220.
Heat rate (K/min) 10.10.2.4.4.
Initial hold (min) 5.5. 5.5.
Final hold (min) 30.30. 30.30.
I 1427.1430.1423.1430.1430.
ReferenceWu and Cadwallader, 2002Wu and Cadwallader, 2002Liu, Yang, et al., 2001Chevance and Farmer, 1999Chevance and Farmer, 1999, 2
Comment MSDC-RI MSDC-RI MSDC-RI MSDC-RI MSDC-RI
Column type CapillaryCapillaryCapillary
Active phase DB-WaxCP-WAX 57CBCP-WAX 57CB
Column length (m) 60.50.50.
Carrier gas HeHeHe
Substrate
Column diameter (mm) 0.250.320.32
Phase thickness (μm) 0.25
Tstart (C) 35.60.60.
Tend (C) 210.200.200.
Heat rate (K/min) 2.4.4.
Initial hold (min) 5.5.5.
Final hold (min) 30.10.10.
I 1430.1417.1421.
ReferenceRuther and Baltes, 1994Whitfield, Mottram, et al., 1988Whitfield, Mottram, et al., 1988
Comment MSDC-RI MSDC-RI MSDC-RI

Kovats' RI, non-polar column, isothermal

Data compiled by: NIST Mass Spectrometry Data Center, William E. Wallace, director

Column type CapillaryCapillaryCapillaryPackedPacked
Active phase OV-101OV-101OV-101Apiezon MApiezon M
Column length (m) 50.50.50.2.12.1
Carrier gas    He or N2
Substrate    Chromosorb W, AW-DMCSChromosorb W, AW/DMS
Column diameter (mm) 0.320.320.32
Phase thickness (μm)
Temperature (C) 120.130.140.130.130.
I 900.901.903.903.903.
ReferenceMisharina, Aerov, et al., 1988Misharina, Aerov, et al., 1988Misharina, Aerov, et al., 1988Garbuzov, Misharina, et al., 1985Golovnya, Garbuzov, et al., 1978
Comment MSDC-RI MSDC-RI MSDC-RI MSDC-RI MSDC-RI

Normal alkane RI, polar column, temperature ramp

Data compiled by: NIST Mass Spectrometry Data Center, William E. Wallace, director

Column type CapillaryCapillaryCapillaryCapillaryCapillary
Active phase HP-InnowaxDB-WaxFFAPZB-WaxDB-Wax
Column length (m) 15.30.30.60.15.
Carrier gas HeliumHeliumHeliumHeliumHe
Substrate
Column diameter (mm) 0.320.320.320.320.32
Phase thickness (μm) 0.500.250.250.500.25
Tstart (C) 40.40.40.40.40.
Tend (C) 250.230.240.220.230.
Heat rate (K/min) 3.6.6.4.6.
Initial hold (min)  2.2.5.
Final hold (min)  20. 5.20.
I 1405.1420.1432.1472.1422.
ReferencePuvipirom and Chaisei, 2012Chen, Song, et al., 2009Christlbauer and Schieberle, 2009Marin, Pozrl, et al., 2008Kishimoto, Wanikawa, et al., 2006
Comment MSDC-RI MSDC-RI MSDC-RI MSDC-RI MSDC-RI
Column type CapillaryCapillaryCapillaryCapillaryCapillary
Active phase HP-InnowaxDB-WaxTC-WaxDB-WaxDB-Wax
Column length (m) 60.30.60.60.60.
Carrier gas HeH2HeHeHe
Substrate
Column diameter (mm) 0.320.320.250.320.25
Phase thickness (μm) 0.50.50.50.250.25
Tstart (C) 60.40.40.40.40.
Tend (C) 220.200.230.230.210.
Heat rate (K/min) 2.4.3.6.3.
Initial hold (min)  5.8.
Final hold (min) 10.  20.
I 1450.1448.1448.1415.1435.
ReferenceSenger-Emonnot, Rochard, et al., 2006Culleré, Escudero, et al., 2004Ishikawa, Ito, et al., 2004Akiyama, Murakami, et al., 2003Kumazawa and Masuda, 2003
Comment MSDC-RI MSDC-RI MSDC-RI MSDC-RI MSDC-RI
Column type CapillaryCapillaryCapillaryCapillaryCapillary
Active phase DB-WaxDB-WaxDB-FFAPHP-WaxDB-Wax
Column length (m) 30.30.30.60.30.
Carrier gas HeH2HeHeHe
Substrate
Column diameter (mm) 0.250.320.320.250.53
Phase thickness (μm) 0.250.50.250.51.
Tstart (C) 40.40.40.40.40.
Tend (C) 210.200.230.190.225.
Heat rate (K/min) 3.4.6.3.6.
Initial hold (min)  5.2.6.5.
Final hold (min)   5. 30.
I 1434.1445.1411.1461.1436.
ReferenceKumazawa and Masuda, 2003López, Ortín, et al., 2003Sanz, Czerny, et al., 2002Sanz, Maeztu, et al., 2002Cadwallader and Heo, 2001
Comment MSDC-RI MSDC-RI MSDC-RI MSDC-RI MSDC-RI
Column type CapillaryCapillaryCapillary
Active phase DB-WaxDB-WaxCarbowax 20M
Column length (m) 60.60.50.
Carrier gas  HeHe
Substrate
Column diameter (mm) 0.250.320.25
Phase thickness (μm)  0.25
Tstart (C) 30.60.70.
Tend (C) 170.220.180.
Heat rate (K/min) 2.3.2.
Initial hold (min) 4.
Final hold (min) 30.
I 1425.1423.1431.
ReferenceButtery and Ling, 1998Guntert, Brüning, et al., 1990Tressl and Silwar, 1981
Comment MSDC-RI MSDC-RI MSDC-RI

Kovats' RI, polar column, temperature ramp

Data compiled by: NIST Mass Spectrometry Data Center, William E. Wallace, director

Column type Capillary
Active phase DB-Wax
Column length (m) 60.
Carrier gas He
Substrate
Column diameter (mm) 0.25
Phase thickness (μm)
Tstart (C) 60.
Tend (C) 180.
Heat rate (K/min) 4.
Initial hold (min) 4.
Final hold (min) 30.
I 1402.
ReferenceYeo and Shibamoto, 1991
Comment MSDC-RI

References

Escudero, Campo, et al., 2007
Escudero, A.; Campo, E.; Fariña, L.; Cacho, J.; Ferreira, V., Analytical Characterization of the Aroma of Five Premium Red Wines. Insights into the Role of Odor Families and the Concept of Fruitiness of Wines, J. Agric. Food Chem., 2007, 55, 11, 4501-4510, https://doi.org/10.1021/jf0636418 . [all data]

Carrapiso, Ventanas, et al., 2002
Carrapiso, A.I.; Ventanas, J.; García, C., Characterization of the most odor-active compounds of Iberian ham headspace, J. Agric. Food Chem., 2002, 50, 7, 1996-2000, https://doi.org/10.1021/jf011094e . [all data]

Engel and Schieberle, 2002
Engel, W.; Schieberle, P., Identification and quantitation of key aroma compounds formed in Maillard-type reactions of fructose with cysteamine or isothiaproline (1,3-thiazolidine-2-carboxylic acid), J. Agric. Food Chem., 2002, 50, 19, 5394-5399, https://doi.org/10.1021/jf0203186 . [all data]

Elmore, Mottram, et al., 2000
Elmore, J.S.; Mottram, D.S.; Enser, M.; Wood, J.D., The effects of diet and breed on the volatile compounds of cooked lamb, Meat Sci., 2000, 55, 2, 149-159, https://doi.org/10.1016/S0309-1740(99)00137-0 . [all data]

Hofmann and Schieberle, 1998
Hofmann, T.; Schieberle, P., Identification of key aroma compounds generated from cysteine and carbohydrates under roasting conditions, Z. Lebensm. Unters. Forsch. A, 1998, 207, 3, 229-236, https://doi.org/10.1007/s002170050324 . [all data]

Hofmann and Schieberle, 1997
Hofmann, T.; Schieberle, P., Identification of potent aroma compounds in thermally treated mixtures of glucose/cysteine and rhamnose/cysteine using aroma extract dilution techniques, J. Agric. Food Chem., 1997, 45, 3, 898-906, https://doi.org/10.1021/jf960456t . [all data]

Münch, Hofmann, et al., 1997
Münch, P.; Hofmann, T.; Schieberle, P., Comparison of key odorants generated by thermal treatment of commercial and self-prepared yeast extracts: influence of the amino acid composition on odorant formation, J. Agric. Food Chem., 1997, 45, 4, 1338-1344, https://doi.org/10.1021/jf960658p . [all data]

Hofmann and Schieberle, 1995
Hofmann, T.; Schieberle, P., Evaluation of the key odorants in a thermally treated solution of ribose and cysteine by aroma extract dilution techniques, J. Agric. Food Chem., 1995, 43, 8, 2187-2194, https://doi.org/10.1021/jf00056a042 . [all data]

Mottram and Whitfield, 1995
Mottram, D.S.; Whitfield, F.B., Volatile compounds from the reaction of cysteine, ribose, and phospholipid in low-moisture systems, J. Agric. Food Chem., 1995, 43, 4, 984-988, https://doi.org/10.1021/jf00052a027 . [all data]