n-Butyl methacrylate

Condensed phase thermochemistry data

Data compiled as indicated in comments:
ALS - Hussein Y. Afeefy, Joel F. Liebman, and Stephen E. Stein
DH - Eugene S. Domalski and Elizabeth D. Hearing

Quantity Value Units Method Reference Comment
Δfliquid-413.1 ± 3.3kJ/molCcbLebedev, Kulagina, et al., 1994ALS

Constant pressure heat capacity of liquid

Cp,liquid (J/mol*K) Temperature (K) Reference Comment
273.8298.15Karabaev, Saidov, et al., 1985T = 90 to 350 K. Cp(c) = 248.85 + 4.98T J/kg*K (97 to 192 K); Cp(liq) = 1344.27 + 1.95T J/kg*K (196.8 to 350 K). Cp data calculated from equation.; DH

Phase change data

Data compiled as indicated in comments:
BS - Robert L. Brown and Stephen E. Stein
DH - Eugene S. Domalski and Elizabeth D. Hearing
TRC - Thermodynamics Research Center, NIST Boulder Laboratories, Chris Muzny director
AC - William E. Acree, Jr., James S. Chickos

Quantity Value Units Method Reference Comment
Tboil434.7KN/AAldrich Chemical Company Inc., 1990BS
Quantity Value Units Method Reference Comment
Tfus196.8KN/AKarabaev, Saidov, et al., 1985DH
Tfus196.8KN/AKarabaev, Abduzhaminov, et al., 1985Uncertainty assigned by TRC = 0.2 K; TRC
Quantity Value Units Method Reference Comment
Ttriple197.78KN/ALebedev, Kulagina, et al., 1994, 2Uncertainty assigned by TRC = 0.01 K; TRC

Enthalpy of vaporization

ΔvapH (kJ/mol) Temperature (K) Method Reference Comment
47.4358.AStephenson and Malanowski, 1987Based on data from 343. - 373. K.; AC
45.1359.AStephenson and Malanowski, 1987Based on data from 344. - 437. K.; AC

Enthalpy of fusion

ΔfusH (kJ/mol) Temperature (K) Reference Comment
15.55197.8Lebedev, Kulagina, et al., 1995AC

In addition to the Thermodynamics Research Center (TRC) data available from this site, much more physical and chemical property data is available from the following TRC products:

Kovats' RI, non-polar column, isothermal

Data compiled by: NIST Mass Spectrometry Data Center, William E. Wallace, director

Column type CapillaryCapillaryPackedPackedPacked
Active phase OV-101OV-101SE-30OV-1SE-30
Column length (m) 19.19.3.7 3.7
Carrier gas N2N2He
Substrate   Celatom silanized (62-72 mesh) Celite 560 silanized
Column diameter (mm) 0.280.28
Phase thickness (μm)
Temperature (C) 120.80.150.150.150.
I 964.967.960.962.962.
ReferenceHorna, Táborský, et al., 1985Horna, Táborský, et al., 1985Ashes and Haken, 1975Ashes and Haken, 1971Allen and Haken, 1970
Comment MSDC-RI MSDC-RI MSDC-RI MSDC-RI MSDC-RI
Column type Packed
Active phase SE-30
Column length (m) 3.7
Carrier gas
Substrate Celite 560
Column diameter (mm)
Phase thickness (μm)
Temperature (C) 150.
I 962.
ReferenceGermaine and Haken, 1969
Comment MSDC-RI

References

Lebedev, Kulagina, et al., 1994
Lebedev, B.V.; Kulagina, T.G.; Smirnova, N.N., Thermodynamics of butylmethacrylate and perdeuterobutylmethacrylate at temperatures of 0 to 330 K, J. Chem. Thermodyn., 1994, 26, 941-957. [all data]

Karabaev, Saidov, et al., 1985
Karabaev, M.; Saidov, A.A.; Abduzhaminov, T.P.; Kenisarin, M.M., Heat capacity and molecular kinetic processes of condensed phase acrylates and methacrylates, Izv. Akad. Nauk UzSSR, Ser. Fiz.-Math., 1985, (6), 51-54. [all data]

Aldrich Chemical Company Inc., 1990
Aldrich Chemical Company Inc., Catalog Handbook of Fine Chemicals, Aldrich Chemical Company, Inc., Milwaukee WI, 1990, 1. [all data]

Karabaev, Abduzhaminov, et al., 1985
Karabaev, M.K.; Abduzhaminov, T.P.; Kenisarin, M.M.; Saidov, A.A., Thermodynamics of the crystal-liquid phase transition in acrylates and methacrylates., Izv. Akad. Nauk Uzb. SSR Ser., Fiz-Mat. Nauk, 1985, 1985, No. 5, 74-7. [all data]

Lebedev, Kulagina, et al., 1994, 2
Lebedev, B.V.; Kulagina, T.G.; Smirnova, N.N., Thermodynamics of butylmethacrylate and perdeuterobutylmethacrylate at temp. from 0 to 330 K, J. Chem. Thermodyn., 1994, 26, 941. [all data]

Stephenson and Malanowski, 1987
Stephenson, Richard M.; Malanowski, Stanislaw, Handbook of the Thermodynamics of Organic Compounds, 1987, https://doi.org/10.1007/978-94-009-3173-2 . [all data]

Lebedev, Kulagina, et al., 1995
Lebedev, B.V.; Kulagina, T.G.; Smirnova, N.N.; Kiparisova, E.G.; Novoselova, N.V., Polymerization thermodynamics of n-butyl methacrylate and n-deuterobutyl methacrylate, Zh. Fiz.. Khim., 1995, 69, 4, 581. [all data]