2-Propenoic acid, 2-methyl-, 2-methylpropyl ester

Kovats' RI, non-polar column, isothermal

Data compiled by: NIST Mass Spectrometry Data Center, William E. Wallace, director

Column type CapillaryCapillaryPackedPackedPacked
Active phase OV-101OV-101SE-30OV-1SE-30
Column length (m) 19.19.3.7 3.7
Carrier gas N2N2He
Substrate   Celatom silanized (62-72 mesh) Celite 560
Column diameter (mm) 0.280.28
Phase thickness (μm)
Temperature (C) 120.80.150.150.150.
I 925.928.923.928.928.
ReferenceHorna, Táborský, et al., 1985Horna, Táborský, et al., 1985Ashes and Haken, 1975Ashes and Haken, 1971Germaine and Haken, 1969
Comment MSDC-RI MSDC-RI MSDC-RI MSDC-RI MSDC-RI

Normal alkane RI, non-polar column, custom temperature program

Data compiled by: NIST Mass Spectrometry Data Center, William E. Wallace, director

Column type CapillaryCapillary
Active phase SE-52OV-1, SE-30, Methyl silicone, SP-2100, OV-101, DB-1, etc.
Column length (m) 30.50.
Carrier gas HeHydrogen
Substrate
Column diameter (mm) 0.320.32
Phase thickness (μm) 0.15
Program 45C => 1C/min => 100C => 5C/min => 250C (10min)not specified
I 960.928.
ReferenceTognolini, Barocelli, et al., 2006Waggott and Davies, 1984
Comment MSDC-RI MSDC-RI

Normal alkane RI, non-polar column, temperature ramp

Data compiled by: NIST Mass Spectrometry Data Center, William E. Wallace, director

Column type CapillaryCapillary
Active phase ZB-1ZB-1
Column length (m) 30.30.
Carrier gas NitrogenN2
Substrate
Column diameter (mm) 0.250.25
Phase thickness (μm) 0.250.25
Tstart (C) 45.45.
Tend (C) 230.230.
Heat rate (K/min) 3.3.
Initial hold (min)
Final hold (min)
I 926.926.
ReferenceMierendorff, Stahl-Biskup, et al., 2008Mierendorff, Stahl-Biskup, et al., 2003
Comment MSDC-RI MSDC-RI

References

Horna, Táborský, et al., 1985
Horna, A.; Táborský, J.; Dufka, O.; Matousek, P.; Churácek, J., Chromatography of monomers. II. Glass capillary gas chromatography of C1-C18 alkyl esters of acrylic and methacrylic acids, J. Chromatogr., 1985, 325, 367-378, https://doi.org/10.1016/S0021-9673(00)96047-3 . [all data]

Ashes and Haken, 1975
Ashes, J.R.; Haken, J.K., Gas chromatography of homologous esters. IX. Structure-retention increments of unsaturated esters, J. Chromatogr., 1975, 111, 1, 171-187, https://doi.org/10.1016/S0021-9673(01)80159-X . [all data]

Ashes and Haken, 1971
Ashes, J.R.; Haken, J.K., Gas chromatography of homologous esters. Part V. Retention of aliphatic esters on non-polar, donar and acceptor stationary phases, J. Chromatogr., 1971, 60, 33-44, https://doi.org/10.1016/S0021-9673(00)95527-4 . [all data]

Germaine and Haken, 1969
Germaine, R.W.; Haken, J.K., Gas chromatography of homologous esters. Part 2. Unsaturated esters, J. Chromatogr., 1969, 43, 43-47, https://doi.org/10.1016/S0021-9673(00)99163-5 . [all data]