Pentafluorobenzoic acid, propyl ester

Kovats' RI, non-polar column, isothermal

View large format table.

Column type Active phase Temperature (C) I Reference Comment
CapillarySE-30140.1126.Korhonen and Lind, 1985N2; Column length: 25. m; Column diameter: 0.33 mm
CapillarySE-30160.1134.Korhonen and Lind, 1985N2; Column length: 25. m; Column diameter: 0.33 mm
CapillarySE-30180.1149.Korhonen and Lind, 1985N2; Column length: 25. m; Column diameter: 0.33 mm
CapillarySE-30200.1162.Korhonen and Lind, 1985N2; Column length: 25. m; Column diameter: 0.33 mm

Kovats' RI, polar column, isothermal

View large format table.

Column type Active phase Temperature (C) I Reference Comment
CapillaryOV-351140.1423.Korhonen and Lind, 1985N2; Column length: 25. m; Column diameter: 0.32 mm
CapillaryOV-351160.1426.Korhonen and Lind, 1985N2; Column length: 25. m; Column diameter: 0.32 mm
CapillaryOV-351180.1419.Korhonen and Lind, 1985N2; Column length: 25. m; Column diameter: 0.32 mm

Van Den Dool and Kratz RI, non-polar column, temperature ramp

View large format table.

Column type Active phase I Reference Comment
CapillarySE-301125.Korhonen and Lind, 1985N2, 10. K/min; Column length: 25. m; Column diameter: 0.33 mm; Tstart: 100. C; Tend: 280. C
CapillarySE-301110.Korhonen and Lind, 1985N2, 2. K/min; Column length: 25. m; Column diameter: 0.33 mm; Tstart: 100. C; Tend: 280. C
CapillarySE-301128.Korhonen and Lind, 1985N2, 6. K/min; Column length: 25. m; Column diameter: 0.33 mm; Tstart: 100. C; Tend: 280. C

Van Den Dool and Kratz RI, polar column, temperature ramp

View large format table.

Column type Active phase I Reference Comment
CapillaryOV-3511460.Korhonen and Lind, 1985N2, 10. K/min; Column length: 25. m; Column diameter: 0.32 mm; Tstart: 100. C; Tend: 230. C
CapillaryOV-3511434.Korhonen and Lind, 1985N2, 2. K/min; Column length: 25. m; Column diameter: 0.32 mm; Tstart: 100. C; Tend: 230. C
CapillaryOV-3511469.Korhonen and Lind, 1985N2, 6. K/min; Column length: 25. m; Column diameter: 0.32 mm; Tstart: 100. C; Tend: 230. C

References

Korhonen and Lind, 1985
Korhonen, I.O.O.; Lind, M.A., Gas-liquid chromatographic analyses. XLII. Retention behaviour of C1-C12 n-alkyl esters of benzoic and pentafluorobenzoic acids on SE-30 and OV-351 capillary columns, J. Chromatogr., 1985, 328, 325-332, https://doi.org/10.1016/S0021-9673(01)87403-3 . [all data]