Tricyclo[4.2.2.02,5]decane-3,4-dione, cis-

Gas phase ion energetics data

Data compiled as indicated in comments:
LBLHLM - Sharon G. Lias, John E. Bartmess, Joel F. Liebman, John L. Holmes, Rhoda D. Levin, and W. Gary Mallard

Ionization energy determinations

IE (eV) Method Reference Comment
9.06PEAlbert, Heller, et al., 1985Vertical value; LBLHLM

References

Albert, Heller, et al., 1985
Albert, B.; Heller, C.; Iden, R.; Martin, G.; Martin, H.-D.; Mayer, B.; Oftring, A., Design and synthesis of α-diketones. The cyclobutane-1,2-dione chromophore: Synthesis, dienophilic reactivity and electronic properties of cyclobutenedione and polycyclic cyclobutanediones, Isr. J. Chem., 1985, 25, 74. [all data]