Benzenamine, 2-methoxy-4-nitro-

Condensed phase thermochemistry data

Data compiled by: Hussein Y. Afeefy, Joel F. Liebman, and Stephen E. Stein

Quantity Value Units Method Reference Comment
Δfsolid-197.kJ/molCcbContineanu, Ionescu, et al., 1992
Quantity Value Units Method Reference Comment
Δcsolid-3701.0 ± 0.96kJ/molCcbContineanu, Ionescu, et al., 1992

References

Contineanu, Ionescu, et al., 1992
Contineanu, I.; Ionescu, T.; Marchidan, D.I., The enthalpies of combustion and formation of o-anisidine, o-acetanisidine, 4-nitro-o-anisidine and 5-nitro-o-anisidine, Rev. Roum. Chim., 1992, 37, 1111-1116. [all data]